program: Gaussian 09
title: 000211477
version: EM64L-G09RevD.01
frameworkgroup: C1[X(C13H19NO)]
method: RPBEPBE
basis: SDD
operation: Freq
keyword: #p
keyword: freq=noraman
keyword: PBEPBE/SDD
title: #p freq=noraman PBEPBE/SDD
converged: YES YES NO NO
title: Mulliken charges:
elementType: O N C C C C C C C C C C C C C H H H H H H H H H H H H H H H H H H H
charge: -0.271161 -0.602062 0.170742 -0.470610 -0.101700 0.353177 -0.592413 0.308306 -0.736759 -0.741426 -0.553138 -0.422585 0.296879 -0.395435 -0.536136 0.185452 0.224630 0.209819 0.205015 0.241783 0.212365 0.209507 0.226331 0.222889 0.208850 0.226155 0.252607 0.229905 0.261361 0.259746 0.239699 0.217675 0.218591 0.241942
chargesum: 0.00000
title: Mulliken charges with hydrogens summed into heavy atoms:
elementType: O N C C C C C C C C C C C C C
charge: -0.271161 -0.080954 0.170742 -0.060529 0.108119 0.353177 -0.145615 0.308306 -0.088557 -0.083532 -0.300531 -0.192680 0.296879 -0.155737 0.142072
polarizability: 1.99346615e+02 4.10281224e-01 1.52373282e+02 -1.85806680e+00 1.02748129e+00 9.67164356e+01
1716.lowfreq: -10.4069 -0.0008 -0.0007 -0.0004 8.7788 9.4685 48.7370 77.6540 116.6790
frequency: 48.7282 77.6470 116.6376 140.1271 161.2584 163.0339 201.8447 230.1837 232.3818 244.0112 265.8919 284.3525 303.0048 305.8347 348.8389 355.3561 382.4550 412.3642 443.5743 474.4117 481.3016 514.9682 543.1011 576.2912 622.2897 631.3315 689.5530 732.4567 768.4961 800.2478 824.0403 878.5145 885.1757 891.7946 913.1011 927.0592 936.1121 953.2936 993.0218 1006.4003 1022.2861 1029.5851 1071.4604 1093.4280 1112.5557 1117.9216 1140.3737 1163.4669 1172.8569 1195.9419 1199.0733 1212.6925 1229.6449 1239.9121 1259.2154 1282.7090 1304.4478 1313.5524 1372.6649 1374.9388 1380.3663 1384.1331 1398.4829 1415.3825 1436.0664 1453.3319 1462.0693 1463.7340 1464.4931 1472.6200 1474.1273 1480.7585 1484.5518 1493.5508 1576.4095 1623.5683 1637.3551 2874.4808 2954.0882 2959.3021 2967.0254 2970.6953 2977.0548 3010.4611 3029.1991 3039.4483 3064.5230 3070.1247 3076.4988 3083.6074 3112.9914 3120.1480 3149.3253 3159.9516 3431.3292 3557.8012
redmass: 3.6037 3.0742 2.6242 3.1204 3.1797 2.3189 1.1992 1.2561 1.2596 1.0436 3.0013 2.1613 2.6562 3.0678 3.7121 3.2730 2.5066 3.4071 2.3226 3.0518 3.6028 3.5898 2.6090 3.8149 3.7924 1.3918 5.8364 3.0477 3.7042 1.4206 2.9732 1.8517 2.8580 1.6139 2.1400 1.5365 1.3872 1.9926 1.4576 4.4872 1.7567 1.7207 2.2583 2.3018 1.2597 1.4635 1.4435 1.4250 1.9353 1.9184 1.8206 2.3985 2.4310 1.8473 1.4540 1.8577 1.5635 1.3990 1.6641 1.5163 2.6036 1.6849 1.2328 3.1460 1.1949 1.0925 1.0806 1.0778 1.0505 1.0844 1.0676 1.0662 1.1099 2.2933 7.1048 6.6421 1.1036 1.0810 1.0332 1.0589 1.0572 1.0372 1.0373 1.1013 1.1013 1.1037 1.0994 1.0986 1.0999 1.0995 1.0890 1.0989 1.0904 1.0940 1.0447 1.0969
irintensity: 0.4867 6.7633 0.2513 1.2263 1.3688 2.7561 0.3692 9.6780 10.4628 0.5875 1.4843 20.5058 4.0163 3.0503 1.9999 3.0447 1.1593 0.5131 9.7697 4.8832 13.1919 2.7509 8.9754 26.9851 1.7378 168.0850 3.9029 1.0536 4.4678 36.5145 2.2053 5.0327 0.4178 18.4506 6.3219 0.9066 1.2562 2.0683 5.2431 72.8005 10.1869 2.4814 20.3788 16.3083 0.2003 4.2020 6.5453 0.5075 14.4342 47.3146 3.4905 15.7444 38.2636 35.9201 11.3084 52.6945 7.5450 6.5012 17.9291 20.9035 3.3674 7.1123 9.8358 38.1798 4.2662 3.5664 6.8880 4.5540 12.5930 13.5859 35.1057 11.5723 4.0534 101.6910 29.7924 58.1767 56.9324 72.1571 78.1626 37.7340 35.8432 32.5741 49.1724 25.5637 38.9192 53.1978 8.3606 78.1082 25.9198 40.3744 23.6704 22.6659 7.5300 16.9216 3.3346 0.0099
temp: 298.150 k
press: 1.00000 atm
elementType: 8 7 6 6 6 6 6 6 6 6 6 6 6 6 6 1 1 1 1 1 1 1 1 1 1 1 1 1 1 1 1 1 1 1
symmnumber: 1
zpe: 767872.6 jmol-1
zpe.correction: 0.292467 hartree
zpe.thermalcorrener: 0.307660 hartree
zpe.thermalcorrenthalpy: 0.308605 hartree
zpe.thermalcorrgfe: 0.251612 hartree
zpe.sumelectzpe: -635.599492 hartree
zpe.sumelectthermal: -635.584298 hartree
zpe.sumelectthermalent: -635.583354 hartree
zpe.sumelectthermalfe: -635.640347 hartree
dipole: -0.2109 -1.1417 1.1851
dipole: 1.6591
quadrupole: -75.7703 -86.5263 -95.2186
quadrupole: 5.6692 5.4915 -2.1199
quadrupole: 10.0681 -0.6879 -9.3802 5.6692 5.4915 -2.1199
hfenergy: -635.8919588 hartree
pointgroup: C01 [X(C13H19N1O1)]
dipole: 0.0909025 -0.4476052 -0.4663106 debye
polarizability: 199.3651518|0.1869152|152.3726369|-1.3407042|-0.9885193|96.6985441 unknown
InChI: InChI=1S/C13H19NO/c1-13(2)8-10(14)6-9-4-5-11(15-3)7-12(9)13/h4-5,7,10H,6,8,14H2,1-3H3
charge 0 multiplicity 1
34 atoms
O  3.597733 0.708259 -0.072296
N  -4.061353 -1.408168 -0.055291
C  -1.294828 1.306758 0.022954
C  -2.618666 0.553232 0.344963
C  -2.741776 -0.811492 -0.359957
C  -0.088493 0.33752 0.046978
C  -1.627469 -1.731548 0.17258
C  -0.251663 -1.081781 0.087174
C  -1.121301 2.431982 1.084147
C  -1.388679 1.965089 -1.388774
C  1.220303 0.8696 -0.012377
C  0.901531 -1.900698 0.069363
C  2.360456 0.036312 -0.019758
C  2.208373 -1.37017 0.021252
C  4.807123 -0.114575 -0.069446
H  -3.471474 1.205984 0.06582
H  -2.697135 0.369372 1.434909
H  -2.579415 -0.664414 -1.456334
H  -1.621181 -2.694332 -0.377562
H  -1.882132 -1.970294 1.225814
H  -0.26307 3.088305 0.855118
H  -2.027932 3.066055 1.113068
H  -0.966203 2.004679 2.091306
H  -1.562458 1.210046 -2.176298
H  -2.220576 2.694745 -1.415838
H  -0.454735 2.499704 -1.638906
H  1.388696 1.950584 -0.050303
H  0.774366 -2.990539 0.094432
H  -4.176462 -2.361509 -0.418592
H  -4.852351 -0.809154 -0.318105
H  3.071039 -2.042754 0.011345
H  4.847245 -0.779776 -0.954707
H  4.879846 -0.724671 0.852602
H  5.642438 0.600452 -0.106381
