program: Gaussian 09
title: 000211475
version: EM64L-G09RevD.01
frameworkgroup: C1[X(C13H19NO)]
method: RPBEPBE
basis: SDD
operation: Freq
keyword: #p
keyword: freq=noraman
keyword: PBEPBE/SDD
title: #p freq=noraman PBEPBE/SDD
converged: YES YES NO NO
title: Mulliken charges:
elementType: O N C C C C C C C C C C C C C H H H H H H H H H H H H H H H H H H H
charge: -0.269191 -0.601570 0.168867 -0.468675 -0.102281 0.339125 -0.590508 0.321612 -0.738607 -0.740439 -0.406848 -0.568827 -0.417117 0.321690 -0.536019 0.184625 0.224623 0.209257 0.209364 0.244615 0.206853 0.210146 0.226811 0.223639 0.208651 0.220054 0.223691 0.257307 0.262162 0.259630 0.237844 0.242424 0.218956 0.218136
chargesum: 0.00000
title: Mulliken charges with hydrogens summed into heavy atoms:
elementType: O N C C C C C C C C C C C C C
charge: -0.269191 -0.079778 0.168867 -0.059426 0.106977 0.339125 -0.136530 0.321612 -0.094797 -0.088095 -0.183157 -0.311520 -0.179273 0.321690 0.143497
polarizability: 2.00581721e+02 1.09435765e+00 1.52100160e+02 -1.66472968e+00 1.64344112e+00 9.68225464e+01
1716.lowfreq: -13.9270 -10.0861 0.0006 0.0008 0.0010 15.0208 57.7379 67.3249 103.9227
frequency: 57.5360 67.3052 103.8949 146.1841 161.3595 190.4870 217.0357 223.8874 234.0906 254.6934 259.5756 276.8431 282.1384 316.6593 322.1758 363.8668 392.5521 427.6285 448.6812 465.7423 481.0233 516.7178 542.8878 589.8843 620.8864 639.2341 658.1500 732.8985 745.9255 808.6528 833.6567 866.9260 888.5555 898.8357 914.0466 927.1908 937.7790 952.4703 991.8220 1006.3088 1023.4922 1028.6512 1078.3353 1093.4259 1112.7347 1119.9533 1139.8504 1143.8029 1173.9160 1185.8049 1204.9497 1211.2903 1230.8761 1255.1172 1258.0365 1284.1196 1305.9596 1313.3517 1371.0987 1372.2076 1373.8708 1383.0650 1393.9826 1423.8689 1437.2503 1449.5402 1460.7055 1464.9410 1465.0131 1472.0157 1474.4982 1479.8614 1483.5184 1495.3759 1575.2966 1623.6539 1636.9328 2875.6188 2954.7813 2963.2993 2966.4165 2969.3258 2974.7668 3016.4201 3028.3242 3040.2410 3062.2522 3067.5770 3075.2358 3080.1807 3120.8167 3123.9534 3139.9032 3161.5685 3431.3487 3557.7939
redmass: 3.0169 3.3880 3.0943 3.0022 3.3033 1.4597 1.4754 1.3492 1.7071 1.0529 1.8540 2.4440 2.3439 3.0462 3.0731 2.7824 4.4161 2.9464 2.2335 2.9872 3.2925 3.2944 3.3039 2.8028 1.6827 4.4004 2.8203 4.3988 3.6446 1.4504 2.3917 1.6632 1.9252 2.4771 2.2529 1.5759 1.3940 2.1094 1.4673 3.5350 1.7461 1.7110 2.5224 2.6176 1.2599 1.4922 1.6606 1.5097 1.5801 1.9846 1.8667 1.8964 1.8306 2.7457 1.4383 1.8883 1.5298 1.3524 2.3846 1.3009 2.5155 1.5201 1.2379 2.9966 1.2766 1.0974 1.0946 1.0517 1.0609 1.0789 1.0823 1.1059 1.2055 1.7340 7.1971 6.3763 1.1118 1.0808 1.0331 1.0588 1.0572 1.0371 1.0375 1.1009 1.1013 1.1037 1.0992 1.0984 1.0998 1.0995 1.0982 1.0884 1.0914 1.0939 1.0448 1.0969
irintensity: 2.9033 0.2631 5.1338 1.5031 4.4293 0.9628 1.0353 15.3177 0.5436 0.6627 1.1517 16.5357 10.5140 1.4608 3.8451 2.0903 0.5082 0.8656 13.1357 0.5281 5.8698 2.5000 14.8444 24.9906 130.8357 10.1738 41.3867 5.1532 1.1500 33.6775 9.1186 7.0731 9.2456 1.0085 8.8416 0.3313 0.7182 8.7473 2.2328 53.3690 5.0544 8.2575 12.4156 3.0633 0.2499 4.1182 30.4745 39.5790 10.0149 11.5728 4.4653 12.7428 13.4455 120.4235 25.5929 6.0326 0.2578 11.9436 4.2579 17.7028 37.2973 11.1314 10.1684 16.4780 1.2987 4.0058 3.9565 11.8363 4.4496 11.0780 47.3948 17.0325 1.6776 89.4030 26.4382 90.5550 41.7148 72.9833 76.4129 28.1767 38.0980 31.3194 53.7544 22.4653 41.1070 52.9548 5.0003 90.2174 24.5361 40.6806 37.1490 11.1930 5.7649 17.2684 3.1481 0.0070
temp: 298.150 k
press: 1.00000 atm
elementType: 8 7 6 6 6 6 6 6 6 6 6 6 6 6 6 1 1 1 1 1 1 1 1 1 1 1 1 1 1 1 1 1 1 1
symmnumber: 1
zpe: 767861.2 jmol-1
zpe.correction: 0.292463 hartree
zpe.thermalcorrener: 0.307631 hartree
zpe.thermalcorrenthalpy: 0.308576 hartree
zpe.thermalcorrgfe: 0.251640 hartree
zpe.sumelectzpe: -635.599547 hartree
zpe.sumelectthermal: -635.584379 hartree
zpe.sumelectthermalent: -635.583435 hartree
zpe.sumelectthermalfe: -635.640371 hartree
dipole: -0.1584 1.1619 1.2710
dipole: 1.7293
quadrupole: -76.0255 -87.2843 -95.3571
quadrupole: -6.2838 4.1897 -3.0004
quadrupole: 10.1968 -1.0620 -9.1348 -6.2838 4.1897 -3.0004
hfenergy: -635.8920102 hartree
pointgroup: C01 [X(C13H19N1O1)]
dipole: 0.0632191 0.4607141 -0.4966313 debye
polarizability: 200.5960771|-0.9880337|152.1165141|-1.3037694|-1.2647303|96.7918364 unknown
InChI: InChI=1S/C13H19NO/c1-13(2)8-10(14)6-9-7-11(15-3)4-5-12(9)13/h4-5,7,10H,6,8,14H2,1-3H3
charge 0 multiplicity 1
34 atoms
O  3.71707 -0.949597 -0.012029
N  -3.537289 -2.173099 -0.026988
C  -1.669272 1.223609 0.016949
C  -2.718707 0.123204 0.353212
C  -2.449066 -1.22225 -0.346356
C  -0.236973 0.640324 0.03863
C  -1.113394 -1.781475 0.177256
C  0.018821 -0.765414 0.082224
C  -1.824184 2.357389 1.071913
C  -1.958655 1.817301 -1.396856
C  0.877521 1.511501 -0.030003
C  1.349906 -1.237474 0.059251
C  2.210271 1.047859 -0.044792
C  2.444711 -0.347466 0.001203
C  4.87817 -0.061318 -0.070707
H  -3.725508 0.501479 0.07968
H  -2.732634 -0.070233 1.444286
H  -2.345528 -1.04055 -1.444612
H  -0.833749 -2.704229 -0.36923
H  -1.277076 -2.076268 1.234207
H  -1.193125 3.233181 0.836438
H  -2.875006 2.703446 1.103064
H  -1.548911 1.997785 2.079865
H  -1.910941 1.038612 -2.179157
H  -2.965612 2.276517 -1.423803
H  -1.219603 2.596782 -1.657364
H  0.710523 2.594179 -0.07152
H  1.557431 -2.312983 0.087582
H  -3.374033 -3.121631 -0.384361
H  -4.469659 -1.830558 -0.285569
H  3.034323 1.765704 -0.094721
H  5.752481 -0.729034 -0.068249
H  4.919351 0.60967 0.8100
H  4.876745 0.546936 -0.996841
