program: Gaussian 09
title: 000216670
version: EM64L-G09RevD.01
frameworkgroup: C1[X(C16H14N2O2)]
method: RPBEPBE
basis: SDD
operation: Freq
keyword: #p
keyword: freq=noraman
keyword: PBEPBE/SDD
title: #p freq=noraman PBEPBE/SDD
converged: YES YES NO NO
title: Mulliken charges:
elementType: O O N N C C C C C C C C C C C C C C C C H H H H H H H H H H H H H H
charge: -0.252772 -0.254976 -0.246038 -0.281333 0.363312 0.426250 0.443999 0.170429 -0.506230 -0.353586 -0.375229 -0.374136 -0.353536 -0.204838 -0.213129 -0.217640 -0.210909 -0.248763 -0.254438 -0.507273 0.278663 0.271380 0.262711 0.287541 0.257141 0.231250 0.228533 0.226714 0.224957 0.231435 0.227627 0.249142 0.238683 0.235058
chargesum: 0.00000
title: Mulliken charges with hydrogens summed into heavy atoms:
elementType: O O N N C C C C C C C C C C C C C C C C
charge: -0.252772 -0.254976 -0.246038 -0.281333 0.363312 0.426250 0.443999 0.170429 -0.227566 -0.082206 -0.112519 -0.086595 -0.096395 0.026412 0.015405 0.009074 0.014048 -0.017328 -0.026811 0.215610
polarizability: 2.33751537e+02 -1.77572504e+00 2.22004577e+02 2.06197347e+01 -1.45421221e+01 1.30665807e+02
1716.lowfreq: -4.7735 -2.6945 -0.0009 -0.0004 0.0001 9.4440 39.1210 49.8084 59.7965
frequency: 39.0579 49.7948 59.7877 61.8561 71.4937 116.3785 118.9559 166.5472 188.0315 215.0757 221.9009 256.2265 273.4901 293.3922 332.4567 356.8333 405.7553 408.6482 431.3548 489.3987 498.0232 522.0390 570.5388 609.5097 612.1333 629.5587 634.7453 660.2046 683.3837 690.8272 696.0998 706.3479 758.2160 761.9827 764.3864 817.2924 833.7585 841.2835 904.5848 916.1012 935.2892 966.3177 972.7511 977.1843 986.1084 988.0806 988.7081 993.1337 1015.1794 1030.5384 1039.6179 1077.1776 1088.4904 1117.1661 1117.7713 1146.8051 1154.4705 1172.6893 1173.1915 1186.3673 1189.8401 1200.2498 1270.7057 1296.5031 1319.3778 1328.6195 1377.2623 1383.1001 1395.3767 1433.8856 1443.2641 1450.8589 1462.3418 1472.1333 1480.2469 1484.0160 1579.3338 1591.8247 1595.1365 1606.7572 1610.0686 1650.0585 2984.8549 3082.9148 3129.1260 3132.3535 3140.6833 3142.9626 3146.0329 3159.0032 3160.3984 3171.8727 3172.5767 3181.1261 3192.8493 3256.9303
redmass: 5.6855 3.8592 3.8169 4.3116 5.6674 4.1829 4.4057 1.6740 3.6259 3.6061 2.5284 5.9196 4.8143 4.9711 7.2896 6.5692 2.8973 2.8986 6.6238 4.0575 3.4793 5.3105 8.0530 6.5946 6.4415 5.1953 7.7594 3.3597 2.9697 2.6675 2.1529 3.0772 1.6797 2.0610 1.7231 6.0496 1.2533 1.2469 1.4143 1.3999 8.1478 1.4073 1.3978 6.3349 4.1419 1.7035 3.6350 1.3224 3.6636 2.0725 2.1147 1.9206 1.6367 1.5488 2.2392 2.8332 1.4279 1.0490 1.0512 1.1212 1.1286 2.3350 4.7063 3.5325 1.4024 1.4627 5.0834 8.4789 4.2174 1.3964 2.3618 2.4098 1.0521 1.0731 2.3408 2.3369 6.8819 6.6113 6.6653 6.1248 6.0370 11.0804 1.0312 1.1053 1.0851 1.0852 1.0901 1.0899 1.1022 1.0953 1.0947 1.0974 1.0965 1.0980 1.0957 1.0984
irintensity: 3.2497 1.6225 1.2276 1.5386 0.2534 0.5864 2.1373 2.4297 2.8046 1.1311 2.0578 8.7974 1.0735 0.8595 6.4186 1.4075 0.9114 1.7122 13.8719 5.9636 13.4068 7.7472 7.3086 0.7292 1.1112 24.9990 6.2761 4.9817 1.9684 15.3193 57.0857 15.6352 41.9629 101.6173 58.8193 7.3862 1.0934 0.3640 4.0700 6.5449 76.9262 2.3502 0.1486 25.4307 0.3994 0.1732 0.3567 0.8165 21.1253 3.9120 19.1991 2.0320 12.5361 3.7458 8.1076 61.5666 13.6567 0.2923 0.2988 3.7572 3.1230 50.7295 39.2104 104.1392 33.2892 55.4597 162.2966 1.2355 154.4007 56.6581 3.4224 43.7509 15.4175 19.1039 104.0047 115.4585 209.5021 42.4978 12.2266 29.9422 68.6587 421.7818 56.7251 29.6229 0.3747 0.5654 17.2884 13.1379 12.4409 37.7473 27.9693 8.0431 7.9609 3.2572 1.5900 2.2655
temp: 298.150 k
press: 1.00000 atm
elementType: 8 8 7 7 6 6 6 6 6 6 6 6 6 6 6 6 6 6 6 6 1 1 1 1 1 1 1 1 1 1 1 1 1 1
symmnumber: 1
zpe: 690658.8 jmol-1
zpe.correction: 0.263058 hartree
zpe.thermalcorrener: 0.280035 hartree
zpe.thermalcorrenthalpy: 0.280979 hartree
zpe.thermalcorrgfe: 0.217576 hartree
zpe.sumelectzpe: -876.606501 hartree
zpe.sumelectthermal: -876.589525 hartree
zpe.sumelectthermalent: -876.588580 hartree
zpe.sumelectthermalfe: -876.651983 hartree
dipole: -4.5221 2.6245 -0.9739
dipole: 5.3184
quadrupole: -97.5516 -116.4344 -113.5157
quadrupole: 15.8406 3.7772 2.7923
quadrupole: 11.6156 -7.2671 -4.3485 15.8406 3.7772 2.7923
hfenergy: -876.8695594 hartree
pointgroup: C01 [X(C16H14N2O2)]
dipole: 1.8181619 0.8989208 0.5142237 debye
polarizability: 229.0637614|0.9424674|222.7504192|30.938647|8.8201528|134.6077405 unknown
InChI: InChI=1S/C16H14N2O2/c1-20-16-12-15(19)17(13-8-4-2-5-9-13)18(16)14-10-6-3-7-11-14/h2-12H,1H3
charge 0 multiplicity 1
34 atoms
O  2.810354 -1.406247 0.925142
O  -1.402365 -3.181166 -0.772186
N  0.696982 -0.524852 0.345872
N  -0.531126 -1.009182 -0.214872
C  1.53193 -1.647529 0.485844
C  1.168164 0.801658 0.018433
C  -1.746213 -0.273473 -0.022053
C  -0.448271 -2.461264 -0.363309
C  0.89083 -2.808433 0.092013
C  0.732761 1.450185 -1.162844
C  2.05841 1.449161 0.909285
C  -2.854338 -0.573051 -0.856971
C  -1.856463 0.723819 0.980527
C  1.197165 2.751389 -1.449556
C  2.529034 2.742917 0.599511
C  -4.066196 0.126246 -0.675769
C  -3.07039 1.425991 1.134567
C  2.098761 3.402016 -0.575757
C  -4.181789 1.132488 0.311329
C  3.696853 -2.58504 0.951911
H  1.263617 -3.827235 0.1264
H  0.041015 0.941924 -1.840323
H  2.378495 0.940446 1.822087
H  -2.764057 -1.35776 -1.610723
H  -1.007956 0.941872 1.634812
H  0.856152 3.254162 -2.361048
H  3.222634 3.240824 1.285829
H  -4.921548 -0.115231 -1.31639
H  -3.147792 2.198731 1.907563
H  2.457036 4.411328 -0.804689
H  -5.123046 1.677942 0.438392
H  4.671065 -2.201051 1.284071
H  3.778473 -3.027365 -0.057322
H  3.315219 -3.336324 1.666926
