program: Gaussian 09
title: 000216680
version: EM64L-G09RevD.01
frameworkgroup: C1[X(C21H25N)]
method: RPBEPBE
basis: SDD
operation: Freq
keyword: #pfreq=noraman
keyword: PBEPBE/SDD
title: #p freq=noraman PBEPBE/SDD
converged: YES YES NO NO
title: Mulliken charges:
elementType: N C C C C C C C C C C C C C C C C C C C C C H H H H H H H H H H H H H H H H H H H H H H H H H
charge: -0.077462 -0.027011 -0.433378 0.384205 0.487174 -0.847588 -0.401803 0.133586 0.101691 0.160688 -0.366314 -0.395538 -0.402058 -0.789028 -0.390823 -0.400272 -0.271188 -0.258732 -0.258649 -0.254927 -0.626196 -0.617101 0.216692 0.229895 0.216991 0.235147 0.233882 0.222204 0.222797 0.209389 0.179987 0.244364 0.227206 0.237548 0.227495 0.246251 0.227832 0.225272 0.227445 0.227536 0.227606 0.184336 0.217208 0.234081 0.219678 0.185088 0.224795
chargesum: 0.00000
title: Mulliken charges with hydrogens summed into heavy atoms:
elementType: N C C C C C C C C C C C C C C C C C C C C C
charge: -0.077462 -0.027011 0.013209 0.384205 0.487174 -0.161569 0.043198 0.133586 0.101691 0.160688 0.023063 -0.151174 -0.174852 -0.323985 -0.144572 -0.172441 -0.045916 -0.031286 -0.031113 -0.027321 0.009429 0.012459
polarizability: 2.38634924e+02 2.66500494e+01 2.68512298e+02 4.38949705e+01 -7.81282149e+00 1.97328729e+02
1716.lowfreq: -2.6013 -0.0006 -0.0002 0.0005 7.3247 10.5184 15.5204 24.7136 45.4893
frequency: 15.2359 24.6273 45.4688 66.9377 84.5947 106.1558 108.4514 126.1227 129.1656 173.3668 199.5905 220.6387 232.2371 246.5397 277.7440 284.8025 295.3213 319.1312 334.2888 346.5215 374.9792 384.1476 388.7623 406.5631 432.2403 439.9157 452.5228 470.7293 515.6978 538.5855 566.8087 576.7862 592.5955 617.8197 663.2133 673.8895 701.3874 742.1145 748.1159 755.5529 760.9864 776.2855 782.4358 790.8134 816.9922 843.3737 870.7534 876.4696 878.4826 921.3582 933.0565 949.9049 952.6405 984.5100 986.8077 996.6403 1008.5059 1023.0200 1031.6187 1036.9973 1044.7759 1053.9236 1070.7073 1079.9577 1087.5024 1093.1537 1104.8658 1112.5602 1125.9877 1140.1015 1153.4137 1175.1419 1181.7331 1193.9797 1207.8854 1229.0250 1251.6816 1258.4203 1273.1510 1285.5037 1294.1311 1300.3970 1301.8289 1325.0116 1341.5961 1370.5007 1371.7519 1372.8403 1390.2426 1418.4888 1425.8992 1436.4804 1437.6942 1441.7042 1459.1645 1461.3127 1463.0885 1473.8655 1474.5168 1476.5014 1481.7271 1482.6989 1488.6616 1491.4589 1505.6028 1568.2433 1587.4757 1605.7117 1610.5312 1638.1055 2818.2205 2838.0203 2855.2040 2974.9125 2989.2592 2990.2793 3000.5269 3015.1722 3027.6837 3028.5903 3060.3058 3074.2509 3080.1452 3087.7852 3090.9994 3106.3891 3124.8346 3125.9388 3135.0118 3139.1321 3148.9699 3154.7132 3164.3901 3167.5217 3208.7935
redmass: 2.4942 4.3686 4.0445 3.5519 3.9580 1.9265 3.1474 3.1644 3.5714 2.8899 2.7563 1.1977 3.7718 1.2295 2.7887 3.0371 2.5653 1.8562 2.0879 2.4295 3.4457 3.7412 2.0522 3.5551 2.7049 3.4349 3.9238 3.1487 3.2470 3.0593 3.3561 3.6156 3.9952 6.8143 3.0113 5.0278 1.5351 1.9639 1.3873 2.4456 1.6982 1.6907 2.8063 2.5068 3.5338 1.7150 1.7465 1.5349 1.5154 1.9540 1.3905 1.4211 1.4013 1.3374 1.3298 7.1233 2.2073 2.0618 1.5363 2.2658 2.3664 3.3701 2.1512 2.1685 1.7466 1.4245 2.0195 1.7271 1.6519 2.0742 1.6978 1.0664 1.0960 2.0836 2.1623 1.8573 1.7912 2.1225 1.5835 1.5141 1.4570 1.2768 1.9169 2.1917 1.4082 7.3476 5.7178 1.4052 1.2239 1.1431 1.3241 2.0523 2.4165 1.1618 1.0663 1.0554 1.0799 1.0894 2.2890 1.0577 1.1594 1.0763 1.0750 2.3729 1.0857 5.6992 6.9086 5.9717 6.4816 5.1169 1.0698 1.0578 1.0580 1.0593 1.0533 1.0465 1.0815 1.0714 1.0965 1.0750 1.1039 1.1009 1.0991 1.0997 1.0986 1.0631 1.0846 1.0847 1.0890 1.0898 1.0937 1.0941 1.1001 1.0985 1.1117
irintensity: 0.5069 0.0524 0.0093 0.1465 0.4833 0.8618 0.3521 0.4103 1.2228 1.0918 0.2247 1.3173 0.1529 0.8979 0.6151 0.7732 0.3697 3.2105 4.0273 2.8893 0.3812 0.8759 0.0592 0.9860 0.1062 2.1980 3.4155 2.5988 5.5502 2.1087 0.8605 4.0334 3.6823 4.6113 0.3406 1.2731 7.7132 65.7690 12.8584 7.6230 24.1504 52.2578 6.0893 2.2721 10.5331 2.1774 1.0137 0.4653 1.4050 7.8117 62.5479 2.0826 2.2395 0.0071 0.0272 2.5497 11.5481 14.2146 17.7935 7.6862 4.3841 7.6874 10.5024 13.6998 2.3682 5.9985 2.7577 4.3229 8.8015 3.1073 4.0071 0.4598 0.5143 4.5007 1.4446 10.7998 1.8503 1.7380 5.9849 6.7623 8.2415 6.6277 0.4657 3.0649 0.8184 2.3247 3.9527 18.7628 20.2529 2.3886 15.2498 15.3313 21.2846 3.7606 6.3568 12.1305 6.6439 3.7615 23.7168 19.1486 8.9044 8.2606 17.6958 5.6472 10.1863 0.0219 0.6891 1.3560 1.9179 21.8939 63.0582 68.8874 202.5307 13.6845 4.4117 24.2229 35.7839 48.7155 1.6103 48.5027 49.9171 36.9753 26.1005 45.7077 30.2049 5.8339 1.7346 0.0697 12.5828 11.1498 13.2719 35.7066 43.6479 23.7245 11.6927
temp: 298.150 k
press: 1.00000 atm
elementType: 7 6 6 6 6 6 6 6 6 6 6 6 6 6 6 6 6 6 6 6 6 6 1 1 1 1 1 1 1 1 1 1 1 1 1 1 1 1 1 1 1 1 1 1 1 1 1
symmnumber: 1
zpe: 1052287.8 jmol-1
zpe.correction: 0.400795 hartree
zpe.thermalcorrener: 0.421568 hartree
zpe.thermalcorrenthalpy: 0.422512 hartree
zpe.thermalcorrgfe: 0.350625 hartree
zpe.sumelectzpe: -868.357431 hartree
zpe.sumelectthermal: -868.336658 hartree
zpe.sumelectthermalent: -868.335714 hartree
zpe.sumelectthermalfe: -868.407602 hartree
dipole: 0.2632 0.4592 -0.6970
dipole: 0.8752
quadrupole: -130.4365 -123.0762 -130.1673
quadrupole: 5.3630 5.0945 -1.3058
quadrupole: -2.5432 4.8171 -2.2739 5.3630 5.0945 -1.3058
hfenergy: -868.7582265 hartree
pointgroup: C01 [X(C21H25N1)]
dipole: 0.0921473 -0.1744887 0.2821599 debye
polarizability: 239.5717786|-27.033704|269.2549082|-42.1844066|-9.6955661|195.6492647 unknown
InChI: InChI=1S/C21H25N/c1-16-17-10-5-6-11-18(17)19-12-7-8-13-20(19)21(16,2)14-9-15-22(3)4/h5-8,10-13H,1,9,14-15H2,2-4H3
charge 0 multiplicity 1
47 atoms
N  4.777841 0.587222 0.67622
C  -0.121123 1.094995 -0.898223
C  0.952183 1.077603 0.265176
C  -1.497835 1.315701 -0.220951
C  -0.155876 -0.284524 -1.586071
C  0.229545 2.230159 -1.887208
C  2.410667 0.840519 -0.183382
C  -2.167934 0.208941 0.39314
C  -0.592665 -1.406873 -0.706943
C  -1.576029 -1.151965 0.3010
C  3.33902 0.645332 1.033857
C  -2.083353 2.600473 -0.134574
C  -3.404411 0.431959 1.056096
C  0.174531 -0.499798 -2.890025
C  -0.047317 -2.709426 -0.835102
C  -1.972297 -2.21529 1.154887
C  -3.306932 2.811295 0.539484
C  -3.972007 1.718848 1.138131
C  -0.464177 -3.760322 0.007694
C  -1.428955 -3.50803 1.011807
C  5.131418 -0.607011 -0.117555
C  5.643763 0.723137 1.865534
H  0.87458 2.048336 0.795189
H  0.667174 0.296246 0.99633
H  0.362658 3.188516 -1.354828
H  1.180791 2.021227 -2.404301
H  -0.557286 2.362347 -2.651425
H  2.445956 -0.047762 -0.842583
H  2.791743 1.698459 -0.768389
H  3.20532 1.503907 1.721929
H  3.016753 -0.272193 1.596969
H  -1.587177 3.455983 -0.60127
H  -3.945824 -0.414316 1.491867
H  0.496923 0.304165 -3.556554
H  0.097112 -1.497602 -3.336815
H  0.729128 -2.88884 -1.58701
H  -2.699283 -2.031125 1.952538
H  -3.739929 3.816759 0.585926
H  -4.928895 1.865168 1.651132
H  -0.027582 -4.759223 -0.100981
H  -1.744634 -4.311136 1.686864
H  4.927329 -1.56864 0.421831
H  6.20723 -0.576599 -0.367312
H  4.566464 -0.620069 -1.064576
H  6.703111 0.760435 1.552831
H  5.53209 -0.116778 2.599587
H  5.409693 1.666694 2.390561
