program: Gaussian 09
title: 000216651
version: EM64L-G09RevD.01
frameworkgroup: C1[X(C15H25NO)]
method: RPBEPBE
basis: SDD
operation: Freq
keyword: #p
keyword: freq=noraman
keyword: PBEPBE/SDD
title: #p freq=noraman PBEPBE/SDD
converged: YES YES NO NO
title: Mulliken charges:
elementType: O N C C C C C C C C C C C C C C C H H H H H H H H H H H H H H H H H H H H H H H H H
charge: -0.267680 -0.571440 -0.367907 -0.369266 -0.351441 -0.406867 -0.355965 -0.313204 -0.695542 0.347578 0.492827 -0.540984 -0.384877 -0.351615 -0.382634 -0.424150 -0.388635 0.192441 0.191619 0.190873 0.188362 0.187124 0.187920 0.213735 0.214906 0.195596 0.195668 0.204180 0.203584 0.209803 0.216217 0.209710 0.194717 0.228237 0.246358 0.245498 0.230193 0.231372 0.198076 0.219586 0.274981 0.261048
chargesum: 0.00000
title: Mulliken charges with hydrogens summed into heavy atoms:
elementType: O N C C C C C C C C C C C C C C C
charge: -0.267680 -0.035412 0.016152 0.009969 0.023602 0.021773 0.035299 0.094561 -0.059812 0.347578 0.492827 -0.118030 -0.138519 -0.106118 -0.152441 -0.192777 0.029027
polarizability: 2.63703759e+02 3.15974517e+00 1.55005535e+02 1.79466850e+00 5.87544554e+00 1.17629271e+02
1716.lowfreq: -5.4872 -3.7902 -0.0012 -0.0008 0.0008 10.8221 14.9828 27.8331 39.0854
frequency: 13.4677 27.2642 38.8842 45.8775 50.2711 78.3868 91.6209 103.7158 110.9781 116.0490 145.5405 155.5296 165.7019 203.3455 218.5356 225.1960 233.6847 307.9029 321.3958 356.6626 376.5497 408.7264 413.1745 452.0901 495.0086 525.3413 575.4979 593.9410 634.2940 721.6215 723.0768 737.9893 764.2846 777.0534 792.9366 813.5237 823.7485 839.3861 842.7550 889.6974 919.0975 931.2675 950.0789 962.1412 968.6569 1001.3784 1003.2868 1007.4846 1019.4036 1033.9394 1061.2523 1080.0421 1088.8133 1090.2369 1106.8806 1125.7054 1129.4894 1149.1841 1179.3738 1191.2912 1212.0516 1222.0237 1228.0020 1229.5321 1234.4914 1273.5949 1277.9800 1279.8437 1281.3692 1290.7573 1295.1420 1304.3153 1308.3368 1322.6055 1351.9120 1357.6321 1373.9221 1375.5067 1389.5786 1390.1321 1416.3392 1462.7958 1464.3056 1469.0970 1472.2320 1473.7434 1477.5287 1480.3059 1486.6246 1489.9267 1492.3192 1502.9398 1582.8259 1623.6077 1637.5875 2880.1783 2940.8449 2951.6156 2952.5265 2960.3272 2968.6573 2971.5731 2974.6261 2986.7422 2992.9220 2996.4171 2997.3657 3015.6887 3022.4267 3035.1292 3053.9625 3060.7165 3067.9385 3071.1772 3118.3173 3121.1034 3160.2051 3163.6339 3456.0064 3583.8462
redmass: 3.9823 3.9986 2.1321 3.1481 2.5719 3.9111 2.1075 1.7978 3.1816 3.1246 1.9272 2.1952 4.3593 2.9760 3.3993 1.3953 1.1136 2.8608 3.5180 2.9453 4.2478 3.9885 2.9742 3.1006 3.6268 2.6629 2.8489 1.5317 6.7161 3.7059 1.0648 1.0919 4.3962 1.1380 1.1485 1.6492 1.9731 1.5969 1.4413 1.8721 1.1984 1.5888 1.5301 1.3548 7.1594 1.1591 2.6625 3.9704 1.9388 3.1366 3.0032 2.1331 2.2904 2.4644 1.6810 2.6370 1.2769 1.4411 1.2494 1.6060 1.8079 2.8021 1.2989 1.8209 1.3480 1.2266 1.2500 1.0696 1.1416 1.0818 1.1270 1.4600 1.2909 1.3684 1.5310 1.6526 2.4695 1.4759 1.3944 1.5654 3.3612 1.0725 1.0744 1.0747 1.0963 1.0863 1.0424 1.1029 1.1187 1.1433 1.0872 2.1162 7.0146 6.4861 1.0950 1.0712 1.0550 1.0590 1.0589 1.0592 1.0588 1.0366 1.0642 1.0972 1.0594 1.1007 1.1055 1.1036 1.0870 1.1047 1.0999 1.1049 1.1007 1.0993 1.0894 1.0891 1.0941 1.0943 1.0448 1.0976
irintensity: 0.3455 0.3579 0.7029 0.6546 0.0946 0.0551 4.2359 0.0649 0.4085 0.8583 0.0292 2.0230 0.6553 11.0814 2.7861 37.4554 0.0042 5.6072 9.5252 5.9297 3.4541 2.7090 0.0209 0.3192 2.9858 20.3971 113.3256 153.5094 0.7935 2.8905 12.9936 0.3053 12.5402 6.7213 1.6917 24.6155 7.0763 21.7182 22.8196 2.8291 0.2819 0.5144 0.7775 0.8915 62.4221 1.1465 4.5484 23.2742 0.5430 0.9856 10.6896 0.6592 25.2448 10.4872 34.3651 13.2199 11.1582 0.7754 72.5183 0.4609 54.4532 196.1371 7.1780 17.8661 0.0553 0.3593 1.4174 0.3338 3.6577 0.8933 0.0334 1.1269 1.9750 0.1528 0.6383 0.7900 1.6133 17.1372 33.0283 9.5472 1.6081 0.1312 0.0891 3.8528 5.5742 2.6677 12.5004 26.1112 12.7573 61.4132 5.0510 103.5867 9.4854 51.7198 37.2243 98.2232 28.8598 0.2881 6.1429 22.5083 116.4234 37.9916 39.4339 0.7215 40.7377 11.7434 16.5940 0.0315 25.5365 61.8395 34.1942 79.5841 108.7163 55.5637 16.2285 25.5458 17.1684 6.7560 1.2011 0.3641
temp: 298.150 k
press: 1.00000 atm
elementType: 8 7 6 6 6 6 6 6 6 6 6 6 6 6 6 6 6 1 1 1 1 1 1 1 1 1 1 1 1 1 1 1 1 1 1 1 1 1 1 1 1 1
symmnumber: 1
zpe: 970438.0 jmol-1
zpe.correction: 0.369620 hartree
zpe.thermalcorrener: 0.389584 hartree
zpe.thermalcorrenthalpy: 0.390528 hartree
zpe.thermalcorrgfe: 0.317892 hartree
zpe.sumelectzpe: -715.213600 hartree
zpe.sumelectthermal: -715.193637 hartree
zpe.sumelectthermalent: -715.192692 hartree
zpe.sumelectthermalfe: -715.265328 hartree
dipole: 0.6334 -0.4830 0.7922
dipole: 1.1235
quadrupole: -91.9152 -105.1915 -106.4895
quadrupole: -6.7254 -7.7144 -0.6981
quadrupole: 9.2835 -3.9928 -5.2907 -6.7254 -7.7144 -0.6981
hfenergy: -715.5832205 hartree
pointgroup: C01 [X(C15H25N1O1)]
dipole: 0.2529891 -0.3469488 0.1048363 debye
polarizability: 263.7174528|2.4324788|132.7101213|2.3246166|19.2598932|139.9109909 unknown
InChI: InChI=1S/C15H25NO/c1-2-3-4-5-6-13-17-15-9-7-14(8-10-15)11-12-16/h7-10H,2-6,11-13,16H2,1H3
charge 0 multiplicity 1
42 atoms
O  0.069808 0.584966 0.801589
N  -7.587535 -1.342674 -0.038368
C  5.02454 0.096856 0.424204
C  3.651707 -0.32494 -0.14655
C  6.216144 -0.555203 -0.31216
C  2.465908 0.320084 0.606858
C  7.591035 -0.113147 0.239137
C  1.117654 -0.066815 -0.004358
C  8.775931 -0.772261 -0.499442
C  -1.267757 0.391723 0.414382
C  -4.045465 0.142707 -0.199466
C  -5.525792 -0.029334 -0.499043
C  -2.236753 1.040673 1.219748
C  -1.681045 -0.382045 -0.698449
C  -3.603872 0.912616 0.911393
C  -3.060253 -0.495956 -0.990035
C  -6.163611 -1.18619 0.316356
H  5.070455 -0.165371 1.501772
H  5.119042 1.201467 0.368843
H  3.562952 -1.430851 -0.104217
H  3.605745 -0.048884 -1.221122
H  6.16054 -0.308038 -1.393268
H  6.132634 -1.660187 -0.241776
H  2.561919 1.42282 0.591131
H  2.479161 0.011798 1.669945
H  7.674825 0.990459 0.164681
H  7.645394 -0.356253 1.320042
H  0.972423 -1.167966 0.016375
H  1.047896 0.278377 -1.057851
H  8.73436 -1.874476 -0.411122
H  9.746633 -0.437002 -0.090007
H  8.759066 -0.522293 -1.577253
H  -6.073857 0.906985 -0.267559
H  -5.694422 -0.24497 -1.569879
H  -1.895152 1.637663 2.071192
H  -0.952164 -0.887736 -1.338515
H  -4.343479 1.426515 1.538266
H  -3.373137 -1.092384 -1.856291
H  -5.978472 -0.996161 1.40183
H  -5.639166 -2.127524 0.065734
H  -8.019765 -2.208181 0.297797
H  -8.162377 -0.520369 0.172356
