program: Gaussian 09
title: 000211469
version: EM64L-G09RevD.01
frameworkgroup: C1[X(C7H6N4)]
method: RPBEPBE
basis: SDD
operation: Freq
keyword: #p
keyword: freq=noraman
keyword: PBEPBE/SDD
title: #p freq=noraman PBEPBE/SDD
converged: YES YES YES YES
title: Mulliken charges:
elementType: N N N N C C C C C C C H H H H H H
charge: -0.442801 -0.125783 -0.013193 0.002742 0.334473 0.172934 -0.275257 -0.443079 -0.180711 -0.312525 -0.330621 0.289118 0.342276 0.225460 0.237672 0.269832 0.249466
chargesum: 0.00000
title: Mulliken charges with hydrogens summed into heavy atoms:
elementType: N N N N C C C C C C C
charge: -0.100526 -0.125783 -0.013193 0.002742 0.334473 0.172934 0.013861 -0.217619 0.056961 -0.042694 -0.081155
polarizability: 1.61679925e+02 8.49563423e-01 9.76981292e+01 -7.22025947e-04 4.12236943e-04 4.05033981e+01
1716.lowfreq: -7.7031 -5.1627 -0.0004 -0.0003 0.0007 3.8978 35.1855 108.9725 146.9156
frequency: 34.8907 108.9705 146.9001 263.2331 345.8386 389.1156 431.4363 490.8829 609.6994 648.2014 688.0686 710.1003 717.4652 720.6096 828.5598 857.4798 904.0129 924.0712 947.2056 954.3284 1000.7474 1005.7477 1021.9241 1063.9713 1087.7225 1111.1937 1180.1301 1198.8982 1227.2612 1266.9904 1313.3828 1317.2248 1357.2763 1381.3014 1410.4627 1450.1336 1532.0826 1552.9680 1596.9826 3102.6078 3139.9898 3159.4336 3177.5615 3258.0500 3612.9846
redmass: 4.7772 5.0583 5.2645 4.1845 7.6247 3.1302 5.6499 4.8525 7.9232 4.9934 1.1749 7.3403 1.9179 5.4963 1.7013 1.3551 1.4563 9.1288 6.5830 1.4398 3.8264 1.3740 3.9047 3.8006 2.7807 1.6911 2.2790 1.4235 4.1443 3.4825 5.7467 1.8239 1.4589 2.4315 2.1542 1.9722 4.8952 5.6137 5.7360 1.0907 1.0889 1.0922 1.1001 1.0991 1.0828
irintensity: 7.2117 0.1909 5.2831 0.0830 0.2014 1.2728 0.9248 0.0002 2.6656 4.3579 70.2743 2.1022 92.4964 1.0306 37.4170 27.6895 4.5430 11.4337 27.7772 1.2159 13.0491 1.0872 2.0263 22.9782 1.1783 8.3391 3.0828 3.0976 16.6730 16.5524 1.5863 0.6839 17.5624 1.4002 44.0436 42.2566 2.6960 8.1066 1.9365 28.9161 5.1857 12.3517 12.5782 2.2378 52.5947
temp: 298.150 k
press: 1.00000 atm
elementType: 7 7 7 7 6 6 6 6 6 6 6 1 1 1 1 1 1
symmnumber: 1
zpe: 330457.0 jmol-1
zpe.correction: 0.125864 hartree
zpe.thermalcorrener: 0.133958 hartree
zpe.thermalcorrenthalpy: 0.134902 hartree
zpe.thermalcorrgfe: 0.091581 hartree
zpe.sumelectzpe: -488.562555 hartree
zpe.sumelectthermal: -488.554462 hartree
zpe.sumelectthermalent: -488.553517 hartree
zpe.sumelectthermalfe: -488.596839 hartree
dipole: 1.0200 0.3154 0.0004
dipole: 1.0676
quadrupole: -65.9773 -60.5849 -66.1150
quadrupole: 6.8134 0.0003 0.0006
quadrupole: -1.7516 3.6408 -1.8893 6.8134 0.0003 0.0006
hfenergy: -488.6884199 hartree
pointgroup: C01 [X(C7H6N4)]
dipole: 0.4007179 0.125922 0.0001358 debye
dipolederiv: 0.0278001 0.2290444 -0.0000253 0.0303806 -0.4030387 0.0000537 -0.0000359 -0.0000106 -0.2044728 -0.4858571 0.0437726 -0.0000469 0.1204409 -0.4083111 0.0000289 -0.0001236 0.0000895 -0.2359113 -0.5536022 -0.2651155 0.0000575 0.0704015 -0.1598825 0.0000541 0.0000022 0.0000035 -0.178485 -0.4204888 -0.020623 -0.000006 -0.0817207 -0.3205109 0.0000125 -0.0000067 0.0000127 -0.2392329 0.2627753 0.0268376 -0.0000214 -0.0671805 -0.1664049 0.0000588 0.0001128 0.0000419 0.0897921 0.3577471 0.0323126 0.0000392 0.0036956 0.4048962 -0.0001303 -0.0000421 -0.0000749 0.086061 -0.030923 -0.0544905 0.0000102 -0.0374841 0.0824764 -0.0000265 0.0000113 -0.0000424 -0.0989943 0.0957807 -0.0062481 0.0000175 0.145112 0.2581864 -0.0000475 -0.0000143 -0.0000502 -0.0838774 -0.1265914 0.1204141 -0.0000224 0.2456352 0.0250652 -0.0000255 -0.0000566 -0.0000208 -0.1027777 0.3235555 -0.0690813 -0.0000159 -0.2980212 0.2091939 -0.0001034 0.0001803 -0.0001448 -0.0656239 0.2896984 0.0412726 -0.0000011 -0.0626981 0.1296237 -0.0000351 0.0000012 -0.0000316 -0.0762674 0.1106419 0.0657594 -0.0000081 0.0518487 0.0392469 0.000015 0.0000024 0.0000229 0.1505785 0.2175671 0.0379354 -0.0000107 0.0674947 0.2211112 0.0000442 -0.0000146 0.0000598 0.3502469 -0.0001607 -0.120738 0.000018 -0.1250437 -0.0451055 0.000024 0.0000097 0.0000281 0.1274843 0.027143 -0.0782212 0.0000135 -0.1090774 -0.0408606 0.0000347 0.0000186 0.0000363 0.1592265 0.0201633 0.0423713 -0.0000003 0.046048 0.0842424 0.0000334 -0.0000623 0.0000737 0.178751 -0.1152491 -0.0252025 0.0000021 0.0001686 0.0900717 0.000009 0.0000175 0.0000067 0.1435023 unknown
polarizability: 161.6707968|1.1426668|97.7072544|-0.0007296|-0.0123385|40.5034008 unknown
InChI: InChI=1S/C7H6N4/c1-2-6(4-8-3-1)7-9-5-10-11-7/h1-5,11H
charge 0 multiplicity 1
17 atoms
N  -1.870885 -1.079636 0.000206
N  -1.807512 1.149329 -0.000585
N  -3.21311 -0.697693 0.000134
N  2.542958 -1.254854 0.000144
C  0.431819 -0.00109 -0.000072
C  -1.032826 0.024864 -0.000081
C  1.150589 1.225041 -0.000289
C  1.181911 -1.20937 0.000126
C  2.558083 1.191413 -0.000278
C  -3.10478 0.664019 -0.000159
C  3.212911 -0.063593 -0.000042
H  0.590319 2.164845 -0.000463
H  -1.646366 -2.072456 0.000499
H  0.68766 -2.189957 0.000255
H  3.142988 2.116078 -0.000446
H  -3.98577 1.299763 -0.000418
H  4.306311 -0.131403 -0.00003
