program: Gaussian 09
title: 000211468
version: EM64L-G09RevD.01
frameworkgroup: C1[X(C14H22N2O3)]
method: RPBEPBE
basis: SDD
operation: Freq
keyword: #p
keyword: freq=noraman
keyword: PBEPBE/SDD
title: #p freq=noraman PBEPBE/SDD
converged: YES YES NO NO
title: Mulliken charges:
elementType: O O O N N C C C C C C C C C C C C C C H H H H H H H H H H H H H H H H H H H H H H
charge: -0.243344 -0.232763 -0.226056 -0.187471 -0.108436 0.077552 -0.397542 -0.393516 0.124839 -0.373656 0.172895 -0.329443 -0.345872 -0.081110 -0.367404 -0.324679 -0.312423 -0.716448 -0.720369 0.237618 0.229097 0.227085 0.236158 0.234786 0.265289 0.214410 0.224780 0.211207 0.205070 0.267919 0.256596 0.195618 0.222444 0.219945 0.191674 0.231201 0.220107 0.223911 0.214638 0.231409 0.224287
chargesum: 0.00000
title: Mulliken charges with hydrogens summed into heavy atoms:
elementType: O O O N N C C C C C C C C C C C C C C
charge: -0.243344 -0.232763 -0.226056 -0.187471 -0.108436 0.077552 0.069172 0.069726 0.124839 0.126418 0.172895 0.109748 0.070405 0.186808 -0.110808 0.093383 0.099196 -0.041230 -0.050034
polarizability: 2.10471032e+02 1.45358462e+01 1.51234486e+02 5.54640918e+00 1.25552424e+00 1.54756736e+02
1716.lowfreq: -16.5594 -11.9527 -6.1277 -0.0006 -0.0004 -0.0004 24.6042 28.7871 35.3341
frequency: 22.6135 28.1742 34.8592 46.3939 76.7225 86.0474 100.8179 146.6978 153.9715 174.7238 185.0952 204.4820 222.6631 255.0496 259.3117 285.2867 294.8428 313.9512 337.8637 353.3440 378.5170 388.7402 396.4233 435.5743 448.9604 463.9109 471.5634 526.2593 580.7557 599.3364 655.9526 686.4171 722.6357 747.8782 772.1392 779.5171 782.0616 806.3265 826.8406 839.7091 861.3385 901.7329 916.1919 938.7870 960.6091 973.7374 1000.1791 1024.5546 1031.7236 1039.1621 1051.9618 1070.6903 1076.5490 1078.1216 1084.2648 1093.9598 1109.4516 1130.0611 1142.2570 1164.7979 1166.4793 1190.6641 1205.6280 1227.1324 1248.4335 1261.8945 1268.3156 1279.8741 1295.8628 1297.9646 1319.3391 1327.6939 1339.7608 1348.4472 1362.6199 1365.0689 1372.4823 1382.8045 1391.1511 1397.3127 1420.1006 1443.3722 1445.5292 1448.2893 1452.0080 1457.6066 1459.7513 1477.7690 1479.8345 1482.3626 1482.9523 1484.1002 1557.0449 1600.6029 1627.9953 2888.6413 2900.8264 2954.5161 2959.1583 2960.1823 2975.6910 2980.2680 3001.4174 3007.5091 3023.6136 3028.5514 3038.9151 3055.3576 3057.9524 3074.8953 3076.4929 3083.2136 3085.6148 3085.7405 3090.3733 3157.8787 3183.8991
redmass: 3.6989 3.9401 4.7476 4.5108 2.6678 2.2201 4.6394 3.0587 3.9733 4.4795 1.5918 1.4177 2.0788 2.4220 2.6804 2.0173 3.0837 2.2783 2.6164 3.0019 3.2244 1.9840 5.3304 5.9169 4.8740 3.3336 3.2612 6.3140 3.1378 2.2952 4.2930 3.2973 3.9303 1.6326 3.6148 1.2246 5.1576 3.7766 1.6970 1.6154 2.3808 2.3353 1.8558 3.9767 1.3853 1.9932 2.4382 2.1761 2.4996 1.5889 1.9154 3.7904 2.9911 1.5238 3.7261 2.1993 2.3425 2.6361 2.6205 2.0873 2.7777 1.0673 2.5857 1.1782 2.0400 1.1506 1.4773 1.4493 1.3388 1.3357 1.3599 1.3437 1.2951 1.3724 1.4897 1.6068 1.2643 1.5051 1.2174 1.2127 2.1017 1.0825 1.0849 1.0788 1.0976 1.1094 1.1070 1.0488 1.0507 1.0456 1.0450 1.0929 8.8034 9.0301 6.3598 1.0690 1.0688 1.0669 1.0665 1.0605 1.0363 1.0361 1.0593 1.0591 1.0925 1.1010 1.0914 1.1005 1.1005 1.0995 1.0991 1.1024 1.0961 1.1024 1.0974 1.0878 1.0986
irintensity: 0.9168 0.1921 5.0009 3.9431 0.1914 0.0949 0.3960 0.8232 7.6408 2.6597 0.0651 1.0954 4.1087 1.0213 1.8255 1.0800 6.3262 12.2837 2.7472 3.6948 2.5723 0.8615 7.7873 13.4230 9.0456 4.7958 6.0963 11.3461 4.0980 1.3316 5.9148 5.3451 1.9984 3.0676 4.2086 3.6109 4.8448 17.7388 38.3986 0.5955 9.3171 11.0269 2.0400 1.2824 1.7608 3.2957 48.8054 12.2189 15.7078 22.8152 17.0084 3.8652 4.3282 0.6879 47.3754 10.5094 11.1944 125.5905 4.9431 15.9075 18.1805 1.7225 36.6888 23.9197 99.2914 0.4713 62.0761 54.6938 8.0446 2.3226 0.9485 24.5705 24.7926 3.5361 38.3287 59.3143 1.2344 2.0603 11.7370 13.0141 53.4426 2.7133 3.2886 0.2275 15.6597 46.0640 8.4520 7.5372 7.5201 28.3663 21.7037 13.0525 192.0273 97.3014 224.4124 71.3938 64.6000 33.7980 55.9559 65.3951 29.3299 22.2141 6.8995 31.0130 29.8205 28.4628 33.0122 3.9970 12.8320 26.4238 52.2046 3.3491 37.5121 50.9405 29.4818 1.7456 4.5993
temp: 298.150 k
press: 1.00000 atm
elementType: 8 8 8 7 7 6 6 6 6 6 6 6 6 6 6 6 6 6 6 1 1 1 1 1 1 1 1 1 1 1 1 1 1 1 1 1 1 1 1 1 1
symmnumber: 1
zpe: 906658.8 jmol-1
zpe.correction: 0.345328 hartree
zpe.thermalcorrener: 0.364877 hartree
zpe.thermalcorrenthalpy: 0.365821 hartree
zpe.thermalcorrgfe: 0.295990 hartree
zpe.sumelectzpe: -880.359537 hartree
zpe.sumelectthermal: -880.339988 hartree
zpe.sumelectthermalent: -880.339044 hartree
zpe.sumelectthermalfe: -880.408875 hartree
dipole: -2.8571 -2.4142 0.3487
dipole: 3.7567
quadrupole: -131.3524 -108.0111 -122.5776
quadrupole: 4.7155 -10.0260 -4.1805
quadrupole: -10.7054 12.6360 -1.9306 4.7155 -10.0260 -4.1805
hfenergy: -880.7048654 hartree
pointgroup: C01 [X(C14H22N2O3)]
dipole: -1.1665812 0.9043741 -0.0755023 debye
polarizability: 211.7317391|-11.2972433|149.8972231|-6.2446704|0.6040538|154.8332923 unknown
InChI: InChI=1S/C14H22N2O3/c1-3-14(4-2)12(17)5-6-16(13(14)18)11-15-7-9-19-10-8-15/h5-6H,3-4,7-11H2,1-2H3
charge 0 multiplicity 1
41 atoms
O  -4.868368 -1.003101 -0.102096
O  0.884894 0.267454 2.15466
O  3.540377 -0.43213 -1.864267
N  0.02859 0.7746 0.048344
N  -2.387236 0.478054 0.041006
C  2.403947 -0.098442 0.270109
C  3.506836 0.877001 0.830152
C  2.752565 -1.549367 0.755148
C  1.063271 0.31525 0.903376
C  -1.264854 1.221794 0.634811
C  2.47371 -0.059031 -1.279637
C  -2.459813 -0.937755 0.493995
C  -3.695924 1.163263 0.207392
C  0.165039 0.799464 -1.343029
C  1.303325 0.417839 -2.007988
C  -3.566791 -1.669264 -0.280235
C  -4.779984 0.390647 -0.564231
C  3.307519 2.364136 0.471265
C  1.741237 -2.633012 0.328094
H  4.470311 0.517904 0.42313
H  3.526155 0.752585 1.928683
H  2.831204 -1.522154 1.857378
H  3.749993 -1.784031 0.340446
H  -1.411929 2.296001 0.413563
H  -1.157688 1.090813 1.732206
H  -2.666184 -0.999536 1.589486
H  -1.487642 -1.428277 0.301145
H  -3.620142 2.193344 -0.191218
H  -3.99473 1.227641 1.281908
H  -0.738945 1.12119 -1.868668
H  1.347634 0.455475 -3.099514
H  -3.307797 -1.702822 -1.36041
H  -3.705642 -2.694257 0.09984
H  -5.777302 0.825216 -0.386684
H  -4.550068 0.412798 -1.651599
H  3.301123 2.522566 -0.62225
H  2.362912 2.76305 0.885998
H  4.131869 2.968419 0.89076
H  0.737841 -2.44301 0.754585
H  1.649878 -2.695205 -0.771652
H  2.06881 -3.623608 0.691598
