program: Gaussian 09
title: 000211462
version: EM64L-G09RevD.01
frameworkgroup: C1[X(C12H17Cl2N)]
method: RPBEPBE
basis: SDD
operation: Freq
keyword: #p
keyword: freq=noraman
keyword: PBEPBE/SDD
title: #p freq=noraman PBEPBE/SDD
converged: YES YES NO NO
title: Mulliken charges:
elementType: Cl Cl N C C C C C C C C C C C C H H H H H H H H H H H H H H H H H
charge: -0.086200 -0.085556 -0.118942 -0.016012 -0.629335 -0.696073 -0.294264 0.675877 -0.627842 -0.598631 -0.450060 -0.357516 -0.225562 -0.235991 -0.239904 0.225010 0.271420 0.207760 0.248868 0.215617 0.226259 0.223053 0.229453 0.204537 0.224122 0.259634 0.294807 0.238799 0.225924 0.231946 0.226927 0.231875
chargesum: 0.00000
title: Mulliken charges with hydrogens summed into heavy atoms:
elementType: Cl Cl N C C C C C C C C C C C C
charge: -0.086200 -0.085556 -0.118942 0.208997 -0.357915 -0.023828 0.155048 0.675877 0.030270 -0.044189 -0.211261 -0.131592 0.006384 -0.009064 -0.008029
polarizability: 1.49259237e+02 -7.83671514e-01 1.75823820e+02 1.42993902e+01 6.79287206e-01 1.35619541e+02
1716.lowfreq: -17.7424 -8.8363 0.0012 0.0020 0.0033 1.2213 16.6663 36.3503 40.3464
frequency: 12.6534 36.2849 40.2868 56.0652 82.1705 95.9388 125.6748 142.3570 166.5667 181.2266 192.6030 210.6458 245.8652 263.8549 291.2085 304.7613 341.3950 402.1942 416.6634 478.9482 501.3603 517.8598 600.9297 615.9059 652.1083 669.3640 700.4768 770.8782 779.6065 785.4824 811.3423 850.2627 896.5330 928.7657 964.1953 977.1826 991.0162 997.1549 1001.2696 1027.2624 1047.3938 1056.3364 1070.2318 1085.1526 1091.8804 1107.7261 1139.1872 1167.8089 1173.8869 1191.1375 1199.6352 1225.6401 1240.1780 1254.7148 1273.7496 1305.9579 1319.5285 1345.2570 1352.0165 1359.2347 1381.9691 1388.6449 1435.9872 1443.1921 1452.7311 1464.3293 1467.9582 1474.3993 1478.4371 1484.5640 1485.4119 1593.2939 1612.3378 2879.6216 2938.5519 2983.4188 3006.8035 3022.4394 3053.3545 3059.3365 3067.0314 3075.0059 3078.5367 3102.5133 3116.8523 3126.6400 3138.7224 3150.0910 3155.1097 3165.9051
redmass: 5.4469 5.9239 4.8125 3.3212 3.2474 3.7568 2.5601 1.9353 2.6068 1.8725 1.2836 4.5432 4.1454 3.0557 5.6375 3.5602 4.0196 2.7946 2.9129 3.7246 3.2192 3.2711 5.4956 6.2695 5.7425 4.5810 1.6062 1.1510 2.5519 2.3025 3.6592 1.2536 2.1236 1.5056 1.9241 1.3955 5.2743 1.3665 1.4520 2.1735 1.9257 2.9807 2.3414 1.8076 1.3550 1.5021 2.1092 1.4196 1.0580 1.1250 1.4430 2.2191 1.4511 1.3653 1.6795 1.3419 1.3537 1.3814 1.3401 1.4301 1.3977 3.6361 1.1460 2.1214 1.0952 1.0563 1.0634 1.0658 1.0618 1.0951 2.1269 5.9911 6.0795 1.0549 1.0687 1.0376 1.0836 1.0753 1.0907 1.0878 1.0598 1.0985 1.0999 1.0982 1.0879 1.0858 1.0910 1.0961 1.1119 1.1015
irintensity: 0.9125 0.7659 0.5820 0.2028 2.5515 0.6909 0.6900 0.5507 0.7325 0.8394 0.1358 2.5503 0.9936 7.0577 7.6778 3.4312 1.4851 0.2825 17.1697 4.6081 1.1913 23.7369 19.5756 0.6687 31.4697 152.2078 80.0543 3.8981 23.2073 7.7699 6.0278 0.2936 19.8381 0.1721 10.9223 0.5633 0.8957 0.0442 1.4889 2.8689 26.3762 14.9499 19.3109 14.1264 3.9764 16.0528 28.8930 26.2010 0.1258 0.3448 8.7858 17.2413 3.6949 19.5673 10.3300 8.3286 0.7215 4.0680 1.6361 1.6087 23.8089 7.2738 6.7761 11.1081 4.4564 7.0038 20.5323 9.3654 9.9774 8.0451 3.8673 1.0411 0.2297 128.8396 56.3341 26.7864 8.6830 32.5385 12.3813 6.1279 15.0324 37.6841 33.9135 16.8339 7.8138 0.8910 13.3570 34.3217 13.7474 19.5716
temp: 298.150 k
press: 1.00000 atm
elementType: 17 17 7 6 6 6 6 6 6 6 6 6 6 6 6 1 1 1 1 1 1 1 1 1 1 1 1 1 1 1 1 1
symmnumber: 1
zpe: 690342.0 jmol-1
zpe.correction: 0.262937 hartree
zpe.thermalcorrener: 0.279699 hartree
zpe.thermalcorrenthalpy: 0.280643 hartree
zpe.thermalcorrgfe: 0.215593 hartree
zpe.sumelectzpe: -1441.181559 hartree
zpe.sumelectthermal: -1441.164797 hartree
zpe.sumelectthermalent: -1441.163853 hartree
zpe.sumelectthermalfe: -1441.228903 hartree
dipole: 0.1488 -0.1305 2.6584
dipole: 2.6657
quadrupole: -121.4069 -100.3731 -99.6679
quadrupole: 11.0074 1.2404 -2.6815
quadrupole: -14.2576 6.7762 7.4814 11.0074 1.2404 -2.6815
hfenergy: -1441.444496 hartree
pointgroup: C01 [X(C12H17Cl2N1)]
dipole: 0.0884248 0.0544254 1.0436334 debye
polarizability: 151.9854907|11.8547028|169.8932631|-14.3730965|5.7654982|138.8238442 unknown
InChI: InChI=1S/C12H17Cl2N/c1-10(15(2)9-8-13)12(14)11-6-4-3-5-7-11/h3-7,10,12H,8-9H2,1-2H3
charge 0 multiplicity 1
32 atoms
Cl -1.055042 2.902544 -1.191249
Cl 2.994716 -2.98544 -1.417269
N  1.672997 0.344107 0.669264
C  1.036318 1.602896 0.195354
C  -0.146565 1.241745 -0.744174
C  2.034252 2.603127 -0.443878
C  2.431581 -0.454972 -0.314758
C  -1.171134 0.276487 -0.2019
C  2.298541 0.433722 1.999837
C  1.998718 -1.924849 -0.195861
C  -1.636877 -0.777913 -1.027152
C  -1.701567 0.404746 1.107824
C  -2.599627 -1.697086 -0.552441
C  -2.66398 -0.508343 1.583655
C  -3.115471 -1.565306 0.756268
H  0.602008 2.081442 1.094658
H  0.218458 0.917525 -1.733225
H  2.441627 2.216181 -1.396507
H  1.549075 3.570348 -0.653065
H  2.880154 2.779703 0.245191
H  3.531919 -0.374604 -0.171893
H  2.220505 -0.105344 -1.340545
H  1.562888 0.799555 2.738494
H  3.189652 1.107073 2.032152
H  2.626554 -0.567654 2.330094
H  2.208882 -2.350227 0.796393
H  0.941148 -2.062505 -0.45891
H  -1.24631 -0.877671 -2.04786
H  -1.369214 1.225942 1.752411
H  -2.947596 -2.50779 -1.20192
H  -3.067874 -0.397589 2.596244
H  -3.864741 -2.27345 1.127266
