program: Gaussian 09
title: 000211458
version: EM64L-G09RevD.01
frameworkgroup: C1[X(C18H22N2O3)]
method: RPBEPBE
basis: SDD
operation: Freq
keyword: #p
keyword: freq=noraman
keyword: PBEPBE/SDD
title: #p freq=noraman PBEPBE/SDD
converged: YES YES NO NO
title: Mulliken charges:
elementType: O O O N N C C C C C C C C C C C C C C C C C C H H H H H H H H H H H H H H H H H H H H H H
charge: -0.189309 -0.298637 -0.299761 -0.126319 -0.018780 -0.128890 -0.154438 -0.450833 -0.560354 -0.395633 0.334609 0.127850 -0.556068 0.316359 -0.428681 -0.524578 -0.556875 -0.431031 0.167117 0.197779 -0.159673 -0.530299 -0.530079 0.207364 0.242003 0.207234 0.217681 0.257169 0.249757 0.220478 0.201583 0.236540 0.217412 0.259194 0.225907 0.254586 0.260173 0.271886 0.252206 0.253535 0.221988 0.231113 0.255011 0.223471 0.230233
chargesum: 0.00000
title: Mulliken charges with hydrogens summed into heavy atoms:
elementType: O O O N N C C C C C C C C C C C C C C C C C C
charge: -0.189309 -0.298637 -0.299761 -0.126319 -0.018780 0.078475 0.087565 -0.025918 -0.053429 0.026427 0.334609 0.127850 -0.102115 0.316359 0.056420 -0.269991 -0.296702 0.093062 0.167117 0.197779 -0.159673 0.176337 0.178635
polarizability: 2.69697469e+02 -9.37872966e+00 2.02009171e+02 1.41908891e+01 9.50597483e+00 1.67765720e+02
1716.lowfreq: -10.4685 -0.0008 -0.0006 -0.0005 3.8762 6.1358 18.0324 33.7224 51.2595
frequency: 17.5619 33.4686 51.2375 53.5259 75.4050 85.3477 91.0192 103.0850 112.8569 127.2093 158.2237 166.5439 171.5474 179.8925 199.0634 208.3882 225.0317 265.9565 281.5994 289.4825 297.3313 334.5747 348.5058 367.8597 384.6171 408.8038 423.1712 429.5731 453.1849 487.1183 497.1599 501.6217 523.5814 537.7219 619.5187 629.7207 667.9692 691.9270 709.6245 719.1846 740.3346 743.9008 751.7531 787.9685 851.2284 878.4024 891.3930 892.6316 911.9082 921.1718 941.1032 947.3392 956.5240 978.4282 1003.7919 1025.8419 1030.0779 1048.5872 1060.3609 1079.1412 1089.9108 1114.2191 1117.8473 1119.6957 1135.7403 1149.9418 1154.1967 1156.0942 1172.2175 1175.5045 1190.3673 1209.3692 1228.9975 1233.8063 1243.5834 1256.0248 1267.9678 1271.6874 1275.9823 1282.3959 1297.8758 1307.2815 1314.4398 1326.4532 1330.8052 1337.0207 1358.0866 1370.6390 1386.9920 1397.3026 1426.1693 1429.9870 1445.2088 1446.2597 1446.6419 1458.4064 1460.4638 1465.4477 1478.3695 1482.3313 1482.5634 1489.0373 1490.6591 1569.6628 1618.9373 1620.2095 2198.0459 2792.6066 2848.3417 2871.1603 2971.7333 2973.7045 2981.7517 2995.0781 2997.0217 3005.0368 3012.4060 3026.6600 3036.8267 3041.3703 3046.1264 3068.3402 3070.3761 3079.5269 3090.3178 3122.0050 3122.6322 3140.2457 3145.7098
redmass: 7.9509 5.2584 4.1953 4.2392 3.3404 3.5997 3.5676 5.0440 2.8499 3.9329 1.5096 2.1987 1.4379 1.8055 3.2552 3.3333 3.5002 4.2908 4.5865 3.6845 3.6041 3.5088 2.5609 3.7311 4.7060 5.0521 5.0142 3.5146 3.8765 3.6604 4.0512 4.6144 3.0459 3.9594 3.5779 3.8790 4.7812 5.1154 3.7004 4.9781 2.7289 2.9638 2.3976 1.9654 2.6893 1.9404 1.9099 1.8269 1.9485 4.1256 2.9798 2.5062 4.8061 2.5054 2.6368 2.0747 2.9434 2.6805 2.2302 3.1626 2.9934 1.2417 1.2418 2.8505 1.9877 1.3554 1.5312 1.5652 1.5269 1.5745 1.7329 1.3935 1.8141 1.3042 1.5430 1.7069 1.3047 1.2253 3.2598 1.3426 1.4998 1.3756 1.5315 1.4557 1.4867 1.5762 1.6120 5.0926 1.6087 2.2713 1.1791 1.0936 1.1298 1.2836 1.1219 1.0577 1.0606 1.0850 1.0556 1.1031 1.0921 1.0526 3.1044 8.5743 7.8385 8.3473 12.4304 1.0795 1.0704 1.0709 1.0310 1.0312 1.0611 1.0602 1.0628 1.0620 1.0845 1.0887 1.0886 1.1005 1.0990 1.1036 1.1038 1.1017 1.0971 1.1027 1.1028 1.0913 1.0911
irintensity: 1.0105 0.4475 2.5961 6.1260 4.4649 0.5642 5.3896 5.9939 5.2917 0.5586 0.7946 0.9107 0.3483 0.7648 11.1213 3.2799 7.6285 4.0092 5.6609 0.9820 1.4476 0.7497 5.1755 0.8589 5.3522 2.1739 3.0049 2.1666 5.8208 1.0001 3.5572 0.8474 19.0700 0.8205 8.2155 6.6954 2.3436 8.5047 16.7850 1.9130 3.2751 11.1278 3.6398 7.1638 1.7654 1.9570 5.5557 1.6848 37.2545 7.6562 21.7799 5.3318 103.3208 14.4910 2.7407 13.2851 9.5518 1.6692 1.2891 13.9257 24.8899 13.5230 6.0206 3.8399 69.0902 8.5376 7.0295 26.7119 56.0712 6.8588 7.9051 11.3392 10.8845 3.0936 7.6213 50.4700 11.5158 6.0166 114.0825 16.2221 6.0683 8.5872 18.9752 15.3049 4.7585 25.2040 82.9647 9.5492 3.5326 9.4138 0.3174 10.1499 7.9658 16.3004 3.7119 12.5592 8.5480 2.3810 6.4751 4.0960 10.2119 19.7139 179.3496 0.7360 53.1284 135.1820 15.6026 53.1873 67.4911 140.6212 89.1818 61.7727 23.3649 2.0990 5.8884 14.1801 22.6014 20.6914 61.1601 32.0161 0.1810 31.1923 22.0892 26.6837 11.8271 22.5930 26.0672 8.3552 1.8858
temp: 298.150 k
press: 1.00000 atm
elementType: 8 8 8 7 7 6 6 6 6 6 6 6 6 6 6 6 6 6 6 6 6 6 6 1 1 1 1 1 1 1 1 1 1 1 1 1 1 1 1 1 1 1 1 1 1
symmnumber: 1
zpe: 963537.7 jmol-1
zpe.correction: 0.366992 hartree
zpe.thermalcorrener: 0.389503 hartree
zpe.thermalcorrenthalpy: 0.390448 hartree
zpe.thermalcorrgfe: 0.314126 hartree
zpe.sumelectzpe: -1032.515844 hartree
zpe.sumelectthermal: -1032.493333 hartree
zpe.sumelectthermalent: -1032.492389 hartree
zpe.sumelectthermalfe: -1032.568710 hartree
dipole: 3.9810 2.0189 -3.6452
dipole: 5.7630
quadrupole: -148.7455 -140.7327 -143.8093
quadrupole: -8.7047 25.2487 -5.9811
quadrupole: -4.3164 3.6965 0.6199 -8.7047 25.2487 -5.9811
hfenergy: -1032.8828364 hartree
pointgroup: C01 [X(C18H22N2O3)]
dipole: -1.6281881 -0.8709146 -1.3157927 debye
polarizability: 268.1267812|-14.0864395|200.7281396|-15.281535|-12.0665668|170.6174391 unknown
InChI: InChI=1S/C18H22N2O3/c1-22-17-8-12-5-7-20-11-13(4-3-6-19)16(21)10-15(20)14(12)9-18(17)23-2/h8-9,13,15H,3-5,7,10-11H2,1-2H3
charge 0 multiplicity 1
45 atoms
O  3.089087 2.367431 -1.32941
O  -3.98159 2.06112 0.047177
O  -4.957715 -0.494897 1.113566
N  1.179957 -1.261382 -0.968695
N  5.99166 -0.279138 3.111541
C  0.368392 -0.025789 -1.113335
C  3.358412 -0.055719 -1.152627
C  2.435627 -1.158959 -1.739693
C  1.161545 1.149131 -0.460461
C  0.41583 -2.505656 -1.213933
C  -1.034102 -0.16717 -0.515249
C  2.578625 1.257789 -1.013674
C  -0.65358 -2.660425 -0.12051
C  -1.521626 -1.413995 -0.038095
C  3.945784 -0.49858 0.220034
C  -1.888127 0.962661 -0.486439
C  -2.826178 -1.481999 0.507782
C  4.887188 0.572403 0.839155
C  -3.192241 0.886222 0.035688
C  -3.657907 -0.348418 0.574589
C  5.501639 0.110633 2.095385
C  -5.210492 1.983658 -0.778152
C  -5.22157 0.327145 2.318983
H  0.24799 0.22415 -2.203457
H  4.194759 0.132601 -1.853954
H  2.242399 -0.932644 -2.819755
H  2.958843 -2.132291 -1.695242
H  1.212367 0.948435 0.628101
H  0.656434 2.117829 -0.607603
H  1.12219 -3.3550 -1.179569
H  -0.067539 -2.511076 -2.223046
H  -0.14317 -2.833601 0.847083
H  -1.281331 -3.548309 -0.324596
H  3.122405 -0.737923 0.915407
H  4.517998 -1.432853 0.063968
H  -1.566834 1.929975 -0.887768
H  -3.21795 -2.428318 0.89742
H  4.337066 1.511661 1.036723
H  5.690564 0.831804 0.122861
H  -5.850815 1.142129 -0.457452
H  -4.943154 1.865633 -1.845532
H  -5.726701 2.943589 -0.625341
H  -5.062029 1.400098 2.10943
H  -4.563047 0.005199 3.147791
H  -6.273464 0.134745 2.579204
