program: Gaussian 09
title: 000216616
version: EM64L-G09RevD.01
frameworkgroup: C1[X(C6H6N4O2S)]
method: RPBEPBE
basis: SDD
operation: Freq
keyword: #p
keyword: freq=noraman
keyword: PBEPBE/SDD
title: #p freq=noraman PBEPBE/SDD
converged: NO YES NO NO
title: Mulliken charges:
elementType: S O O N N N N C C C C C C H H H H H H
charge: 0.308643 -0.278539 -0.231000 -0.382370 -0.395537 -0.034587 -0.618113 0.346304 -0.377215 -0.763193 0.128803 0.155804 0.172435 0.293994 0.297576 0.360793 0.334624 0.356721 0.324858
chargesum: 0.00000
title: Mulliken charges with hydrogens summed into heavy atoms:
elementType: S O O N N N N C C C C C C
charge: 0.308643 -0.278539 -0.231000 -0.021577 -0.060913 -0.034587 0.063466 0.346304 -0.377215 -0.171623 0.128803 0.155804 0.172435
polarizability: 1.87928673e+02 5.42585784e+00 1.31535291e+02 6.42276065e-01 9.28449177e-01 5.24961616e+01
1716.lowfreq: -6.3527 0.0005 0.0007 0.0019 5.7425 6.7875 67.3680 97.2595 134.7585
frequency: 67.3659 97.2544 134.7576 177.0410 190.0253 212.2468 272.4498 297.4518 344.5542 360.3557 386.4153 414.3160 426.0502 508.5488 532.6602 555.9005 574.8381 577.8871 619.8496 669.6945 693.5932 716.1983 751.8362 756.0761 805.8948 879.4955 890.6190 914.5007 1014.1957 1029.9879 1145.7716 1170.2438 1249.3485 1266.3514 1298.1295 1319.2473 1342.6012 1424.7636 1436.8895 1482.2010 1549.8071 1583.4917 1618.0049 1627.7111 1637.8072 3030.6707 3138.8375 3469.4801 3509.0517 3559.6869 3710.0615
redmass: 8.7057 3.0415 8.5865 5.6664 7.7126 7.3388 1.1408 5.0435 7.1877 6.5424 7.9921 7.3581 6.8014 1.1944 3.6452 7.2989 4.6043 3.9182 6.1646 2.6208 2.4956 3.6754 3.9467 1.8491 5.8524 3.2989 4.5148 2.6534 4.9269 1.6722 1.8972 1.7947 1.7789 2.0167 3.2819 2.2095 4.1654 1.1005 2.6510 4.8660 7.3287 2.2724 3.5840 5.7337 2.3292 1.0631 1.1007 1.0757 1.0776 1.0456 1.1053
irintensity: 1.1575 3.9422 3.5752 0.3022 6.7561 6.7950 85.5314 5.3029 2.2393 3.9121 7.1766 3.7891 10.4240 244.1555 0.9379 2.3696 1.6644 1.5333 8.3066 57.1757 14.4526 39.3872 106.9904 38.3800 10.9930 27.4381 10.0947 40.2635 2.4071 12.4734 45.4563 11.8652 33.4389 11.8577 1.1748 58.5180 231.7274 18.0792 26.1264 15.4945 99.3615 276.7143 1124.0470 308.3815 274.3233 11.7070 0.3886 60.7607 32.5923 161.7285 50.1863
temp: 298.150 k
press: 1.00000 atm
elementType: 16 8 8 7 7 7 7 6 6 6 6 6 6 1 1 1 1 1 1
symmnumber: 1
zpe: 343580.8 jmol-1
zpe.correction: 0.130863 hartree
zpe.thermalcorrener: 0.142196 hartree
zpe.thermalcorrenthalpy: 0.143140 hartree
zpe.thermalcorrgfe: 0.093565 hartree
zpe.sumelectzpe: -998.857042 hartree
zpe.sumelectthermal: -998.845709 hartree
zpe.sumelectthermalent: -998.844765 hartree
zpe.sumelectthermalfe: -998.894340 hartree
dipole: -7.3891 -2.3292 1.0801
dipole: 7.8225
quadrupole: -64.2063 -93.7433 -82.9250
quadrupole: -5.4209 2.4560 -1.1220
quadrupole: 16.0852 -13.4518 -2.6335 -5.4209 2.4560 -1.1220
hfenergy: -998.9879046 hartree
pointgroup: C01 [X(C6H6N4O2S1)]
dipole: -2.9584807 0.7355486 -0.4218078 debye
dipolederiv: -0.345937 -0.2415973 -0.0200326 -0.272317 -0.1970407 0.0765656 -0.0812927 -0.0359022 -0.0135605 -0.4500453 0.0398137 -0.0018606 -0.0651663 -1.4450876 -0.0151973 0.0042291 -0.0022851 -0.377335 -1.4566368 0.1580361 -0.020983 0.4228163 -0.5350328 0.0423199 -0.1830725 0.0900141 -0.3628081 -1.4432067 0.2016369 -0.0150978 -0.489592 -0.2690742 0.0163132 0.1219766 0.0506911 -0.312487 -0.6556143 0.2271706 -0.0074778 0.1653345 -0.64711 -0.0006264 -0.0025448 0.0022564 -0.2742023 -1.7605686 0.2317915 -0.0186713 -0.5297276 -0.4444538 -0.0106002 -0.0509213 0.0440333 -0.246149 -1.8097613 0.3797385 -0.0042434 0.3841561 -0.2967848 0.0276879 -0.0197923 0.0257519 -0.732433 0.4496301 -0.706639 0.0499617 -0.3839635 -0.9147074 -0.0202342 0.0880979 -0.1334812 0.0332003 1.2902688 0.1119517 0.0708468 0.4140335 0.9127148 0.0041671 0.0731115 0.0398198 -0.0529249 0.2334531 -0.0350246 -0.1222577 -0.0120402 -0.2379239 0.1040703 -0.09124 0.142805 0.1322063 0.7225725 0.1935744 0.0221069 -0.0766313 1.8134014 0.0141661 -0.0112368 -0.0003415 0.2049488 2.0049588 -0.0764172 0.0524502 0.207761 0.641219 -0.1800375 0.1124377 -0.2378431 0.2213922 2.3087752 -0.3436254 0.028495 0.2623963 0.7212319 0.0309584 0.0532324 0.024823 0.2826763 -0.010598 -0.0539127 0.000093 -0.0071324 0.0730743 -0.0262903 -0.0101829 -0.0251765 0.1153728 0.0512135 0.0189152 -0.0066711 0.0573304 0.0721379 -0.0583069 0.0552766 0.0139969 -0.0755767 0.1782338 -0.0531282 0.01029 0.0191784 0.2345789 0.0223758 -0.0471267 0.027869 0.319675 0.1624092 0.0244371 -0.0051753 -0.0066768 0.1543897 -0.0067018 -0.0065509 -0.0050443 0.3372147 0.2449101 -0.0536164 -0.0074982 -0.1254323 0.2302428 -0.0099474 -0.0099946 -0.0080249 0.3981917 0.2859429 -0.0231049 -0.0042749 0.0356729 0.1342246 -0.0106823 0.0055937 -0.0139615 0.4025986 unknown
polarizability: 188.3897102|-1.8232376|131.0475849|-0.4972373|1.7395326|52.5228311 unknown
InChI: InChI=1S/C6H6N4O2S/c7-6-9-4(12)3-5(10-6)13-1-2(11)8-3/h8-9H,1,7H2
charge 0 multiplicity 1
19 atoms
S  1.041425 2.244747 0.24228
O  -0.650656 -2.691814 -0.049293
O  3.801363 -0.654987 0.148825
N  1.489087 -0.879295 0.144944
N  -2.192715 -0.918916 -0.080258
N  -1.521082 1.368033 0.043997
N  -3.800199 0.838938 -0.0448
C  0.164612 -0.408367 0.024237
C  -0.212994 0.937426 0.072416
C  2.485347 1.286388 -0.533187
C  -0.861828 -1.437177 -0.043736
C  2.656147 -0.147103 -0.025913
C  -2.481842 0.439536 -0.02468
H  3.395107 1.851712 -0.287943
H  2.339441 1.277329 -1.627495
H  1.583709 -1.888543 0.319152
H  -2.927497 -1.631488 -0.131371
H  -3.976863 1.840215 -0.006188
H  -4.579563 0.189263 -0.089685
