program: Gaussian 09
title: 000216615
version: EM64L-G09RevD.01
frameworkgroup: C1[X(C7H6ClN3S)]
method: RPBEPBE
basis: SDD
operation: Freq
keyword: #p
keyword: freq=noraman
keyword: PBEPBE/SDD
title: #p freq=noraman PBEPBE/SDD
converged: YES YES NO YES
title: Mulliken charges:
elementType: Cl S N N N C C C C C C C H H H H H H
charge: -0.037745 0.322467 -0.072324 0.121916 -0.603689 0.378371 -0.794763 -0.545483 0.184538 -0.274297 -0.109961 -0.310863 0.254930 0.305697 0.265896 0.258313 0.322125 0.334872
chargesum: 0.00000
title: Mulliken charges with hydrogens summed into heavy atoms:
elementType: Cl S N N N C C C C C C C
charge: -0.037745 0.322467 -0.072324 0.121916 0.053307 0.378371 -0.234137 -0.545483 0.184538 -0.008401 0.148353 -0.310863
polarizability: 2.19674477e+02 -4.88510589e+00 1.15716668e+02 5.23395155e-02 1.43125285e+00 5.45342066e+01
1716.lowfreq: 0.0030 0.0032 0.0037 2.0914 3.9474 10.7260 62.3605 113.3408 156.4651
frequency: 62.3590 113.3394 156.4648 186.6775 190.8080 293.4294 345.3965 347.9601 369.3154 394.5371 406.8619 458.7268 485.5822 521.9750 533.5037 595.2022 622.7034 642.1739 696.3509 733.8031 754.1467 814.4171 834.0860 877.7104 902.3354 958.9693 1024.8301 1080.3238 1115.2055 1120.6869 1153.4650 1245.4742 1270.8688 1316.1568 1341.4739 1384.0727 1414.0488 1436.6738 1513.0747 1558.2239 1595.7188 1636.0982 3028.7725 3110.4989 3164.2388 3189.3156 3535.4877 3693.8385
redmass: 7.2091 3.0770 6.9975 9.7470 9.1455 7.7633 4.7780 3.6010 8.7341 2.7576 1.5894 4.5350 5.1885 3.5275 2.6405 4.8310 1.7575 7.7744 6.8783 6.3274 5.4894 4.8447 1.6072 3.5861 1.7606 1.3603 3.1305 1.9471 3.8846 1.4299 1.1784 1.2230 2.7672 4.4806 6.9046 3.1430 3.7806 1.1927 6.5767 7.3713 1.7955 2.5100 1.0591 1.1056 1.0899 1.0978 1.0458 1.1039
irintensity: 0.9864 3.8800 6.4428 0.9058 1.6786 4.3164 8.8031 6.9815 2.0308 34.7625 93.6939 4.0423 11.2710 30.5829 58.0482 3.5758 86.1891 14.5865 39.8453 0.6222 6.0516 35.3003 45.5935 9.8569 4.9032 1.0560 15.0220 43.9258 91.1951 2.2092 0.7657 11.5399 30.1867 15.6510 7.0037 295.6080 44.5471 29.4583 26.3524 13.2529 77.1220 720.1494 26.3953 5.7284 2.3286 3.1093 122.6321 42.0642
temp: 298.150 k
press: 1.00000 atm
elementType: 17 16 7 7 7 6 6 6 6 6 6 6 1 1 1 1 1 1
symmnumber: 1
zpe: 324351.8 jmol-1
zpe.correction: 0.123539 hartree
zpe.thermalcorrener: 0.133960 hartree
zpe.thermalcorrenthalpy: 0.134904 hartree
zpe.thermalcorrgfe: 0.086977 hartree
zpe.sumelectzpe: -1291.865031 hartree
zpe.sumelectthermal: -1291.854610 hartree
zpe.sumelectthermalent: -1291.853666 hartree
zpe.sumelectthermalfe: -1291.901593 hartree
dipole: 6.7807 2.1237 1.1146
dipole: 7.1924
quadrupole: -63.3397 -83.4435 -85.1782
quadrupole: -6.2917 0.9572 -1.2811
quadrupole: 13.9808 -6.1230 -7.8578 -6.2917 0.9572 -1.2811
hfenergy: -1291.9885698 hartree
pointgroup: C01 [X(C7H6Cl1N3S1)]
dipole: 2.6685789 0.7921898 0.5083205 debye
dipolederiv: -1.0911971 -0.1046578 -0.0245924 -0.2553965 -0.1527264 -0.0108541 -0.0373026 -0.0090894 -0.0894726 -0.2955193 0.2443227 0.0282481 0.3225689 -0.1712351 0.0855061 0.0894067 0.0072744 -0.0137701 -1.6090084 -0.0293191 0.0738345 0.3954052 -0.4515439 0.0212733 -0.0070335 0.0520371 -0.3049228 -1.0154074 0.1355573 -0.0236921 0.3069226 -0.4004745 -0.0110145 0.0103027 0.0037236 -0.1181695 -1.7449437 -0.1548457 0.0526995 -0.4771242 -0.3143638 -0.1420862 0.2414803 -0.1228373 -0.6327716 0.9631497 0.1793776 -0.0852186 0.5163543 -0.2864391 -0.0302519 -0.0842902 -0.099951 0.0805035 0.1376511 0.0112643 0.0738045 -0.054827 -0.1629306 0.0954597 0.1369437 0.1104297 0.1435771 0.5186274 -0.4266771 -0.0230149 -0.8000873 0.5296543 -0.0005951 -0.1053483 0.0096001 -0.0619268 2.1587308 0.0073658 -0.1284728 -0.1342159 0.5067168 -0.1173819 -0.2550766 -0.1421929 0.1861868 0.0966496 -0.1312856 0.0105641 0.0597796 0.159288 0.0112606 0.0690532 0.0396081 -0.129426 -0.4188858 -0.0107169 -0.0290648 -0.2951301 -0.0528839 0.000182 -0.0664193 -0.000029 -0.097077 1.7381048 0.1262347 0.0485374 0.2428371 0.32986 0.0556146 0.052492 0.0542177 -0.0120562 -0.0876383 0.0898219 -0.0145952 0.0645021 0.0344944 0.0014711 0.0057004 -0.0077672 0.1075753 0.0613568 -0.021214 0.0219091 -0.0352243 0.0574372 -0.0720187 -0.0589164 0.0014478 -0.0800988 0.0694022 -0.0556551 -0.0019813 -0.0288938 -0.0274572 -0.0154031 0.002742 -0.0095844 0.152579 0.014778 0.0803005 0.0094468 0.0816925 0.0361289 -0.0147362 0.0060743 -0.023189 0.1694045 0.2874781 0.0277049 0.0081852 -0.0193834 0.1661171 0.0751112 0.0012856 0.061108 0.3456283 0.2166715 0.0324218 0.0034029 0.1102201 0.2003578 0.068463 -0.0010941 0.0751939 0.3542368 unknown
polarizability: 219.4958254|-6.1527048|115.7231544|2.8812223|2.9720771|54.7063719 unknown
InChI: InChI=1S/C7H6ClN3S/c8-5-2-1-4-7(11-5)12-3-6(9)10-4/h1-2H,3,9H2
charge 0 multiplicity 1
18 atoms
Cl -4.236862 -0.521592 -0.113028
S  0.944988 -2.065251 -0.257497
N  1.559971 1.063025 -0.123991
N  -1.566205 -1.01613 -0.143891
N  3.836386 0.587087 -0.173345
C  0.215999 0.66555 0.000488
C  2.338451 -1.188847 0.676554
C  -0.255353 -0.685232 -0.106212
C  2.539246 0.204084 0.093965
C  -0.786652 1.66853 0.128044
C  -2.15284 1.328071 0.115309
C  -2.472812 -0.039045 -0.04159
H  3.225625 -1.832441 0.572436
H  2.054002 -1.124938 1.740489
H  -0.463138 2.709901 0.213513
H  -2.937144 2.082521 0.206732
H  4.626234 -0.029833 -0.006226
H  3.993803 1.517241 -0.560551
