program: Gaussian 09
title: 000216613
version: EM64L-G09RevD.01
frameworkgroup: C1[X(C7H9N5S)]
method: RPBEPBE
basis: SDD
operation: Freq
keyword: #pfreq=noraman
keyword: PBEPBE/SDD
title: #p freq=noraman PBEPBE/SDD
converged: NO YES NO NO
title: Mulliken charges:
elementType: S N N N N N C C C C C C C H H H H H H H H H
charge: 0.287001 -0.056785 -0.024810 -0.080485 -0.613381 -0.592995 0.180211 -0.370209 0.163604 -0.793417 0.175220 -0.764612 -0.078058 0.250705 0.301275 0.240033 0.231713 0.244359 0.327657 0.315597 0.328842 0.328535
chargesum: 0.00000
title: Mulliken charges with hydrogens summed into heavy atoms:
elementType: S N N N N N C C C C C C C
charge: 0.287001 -0.056785 -0.024810 -0.080485 0.029873 0.064382 0.180211 -0.370209 0.163604 -0.241437 0.175220 -0.048507 -0.078058
polarizability: 2.15610712e+02 5.77999651e+00 1.34984241e+02 1.17099274e+00 6.37698088e-01 6.34620428e+01
1716.lowfreq: -0.0026 -0.0020 -0.0017 3.5258 5.0632 9.2600 62.3280 86.0489 108.9276
frequency: 62.3187 86.0434 108.9239 142.3498 195.9927 213.8945 221.0020 281.8071 336.3514 337.5326 363.5077 387.9066 411.9158 428.5594 437.8019 512.7289 516.7587 542.3285 546.9373 556.3542 598.7506 615.0733 677.9617 718.9935 773.0471 783.8181 840.2203 868.7069 897.9352 953.3164 992.1469 1040.4173 1046.4033 1072.3788 1145.6945 1204.5963 1249.0398 1278.1833 1311.8347 1364.6623 1386.1907 1390.9725 1433.8293 1442.2354 1451.0558 1471.1367 1477.4795 1546.0938 1595.0672 1604.4056 1634.8097 2993.1534 3025.3596 3071.7644 3107.0433 3123.9070 3540.1669 3565.1233 3699.2358 3725.2779
redmass: 4.7522 1.0228 3.0750 5.5703 5.7528 4.7928 4.3815 3.0031 1.5191 5.2019 3.0038 4.3567 3.7175 4.8245 1.2064 1.1376 1.8469 3.9897 4.2278 3.8476 2.2037 4.7334 7.6903 5.5551 7.6856 8.5056 5.6340 3.5593 1.8351 4.1894 1.9376 1.6005 1.8302 2.1689 1.2394 2.9239 1.3170 5.3570 7.5619 4.0208 1.5934 2.9252 1.1336 1.4966 1.1049 2.6181 3.8046 4.2833 1.6848 1.5789 2.7821 1.0371 1.0592 1.0956 1.1053 1.1005 1.0454 1.0439 1.1039 1.1059
irintensity: 2.2036 0.6926 5.3411 3.2411 4.4305 1.8883 3.3624 9.7149 86.1337 2.9461 28.2043 4.5857 26.8235 25.0976 317.0451 2.4046 59.3583 5.7473 9.5721 2.2353 52.3215 17.4558 12.5773 5.8869 2.5836 5.4518 41.1681 0.5626 5.6302 10.5363 10.4892 4.8678 7.8739 2.6945 16.4729 29.1463 4.7969 5.0907 87.3201 97.4215 89.1631 1.0808 23.1001 3.5906 16.5832 178.3826 149.1834 178.4901 60.6020 655.9959 495.2162 11.7069 30.3194 13.8988 7.5789 14.2980 112.7684 144.2422 36.4398 46.2268
temp: 298.150 k
press: 1.00000 atm
elementType: 16 7 7 7 7 7 6 6 6 6 6 6 6 1 1 1 1 1 1 1 1 1
symmnumber: 1
zpe: 433099.0 jmol-1
zpe.correction: 0.164959 hartree
zpe.thermalcorrener: 0.177294 hartree
zpe.thermalcorrenthalpy: 0.178238 hartree
zpe.thermalcorrgfe: 0.126760 hartree
zpe.sumelectzpe: -943.035673 hartree
zpe.sumelectthermal: -943.023338 hartree
zpe.sumelectthermalent: -943.022393 hartree
zpe.sumelectthermalfe: -943.073871 hartree
dipole: 3.3523 0.4744 0.8991
dipole: 3.5030
quadrupole: -51.3751 -85.3605 -85.3874
quadrupole: 5.9449 1.6048 -1.6211
quadrupole: 22.6659 -11.3195 -11.3464 5.9449 1.6048 -1.6211
hfenergy: -943.2006314 hartree
pointgroup: C01 [X(C7H9N5S1)]
dipole: -1.3277748 -0.0975597 0.3562742 debye
dipolederiv: -0.3290124 0.2672513 -0.0181107 0.3506701 -0.1831478 -0.0808242 -0.0986443 -0.0091289 -0.0480632 -1.2674758 -0.0626282 -0.0839336 0.3917729 -0.4167785 -0.0189822 0.0327381 -0.0498609 -0.2781676 -1.4339771 -0.1651502 0.0171901 0.2803468 -0.4106144 -0.0022826 0.0116374 -0.0092624 -0.2094276 -0.9392798 0.0403494 0.0068259 -0.6584419 -0.5933357 0.0146636 0.0414254 0.048569 -0.2519087 -1.7064694 -0.2022708 -0.0864906 -0.5888395 -0.3636644 0.1453587 -0.3112593 0.123986 -0.6440498 -1.8229833 -0.3894853 0.0181312 -0.5120338 -0.2674396 -0.0318063 0.027284 -0.0264148 -0.7277717 0.3540818 0.364256 0.0799228 0.3543507 -0.7458887 0.0412414 0.0934644 0.0976536 0.0552702 0.9666841 -0.1712046 0.0122997 -0.42057 0.7599189 0.0135317 0.0847096 -0.0016736 -0.0271794 0.7211796 -0.2921032 -0.0051889 0.1385429 0.8293619 -0.0262636 -0.0922823 -0.0745125 0.0397116 0.14538 0.0344689 -0.0628287 -0.0891622 -0.1578115 -0.1154525 -0.1370478 -0.1326189 0.1403173 2.0232515 0.0415115 0.1474634 0.1074076 0.4854234 0.1433121 0.3005056 0.1796634 0.1850951 0.0346566 -0.1597555 0.0048669 -0.101589 -0.2929663 0.0039586 0.0233704 0.0083548 0.0151236 2.2229728 0.4306871 -0.0208903 0.511012 0.4375951 -0.0258054 -0.0382826 -0.040844 0.2134726 -0.1053197 0.0859769 0.0151476 0.0622975 0.0390436 -0.0013232 -0.0080505 0.0068996 0.1054541 0.0683115 -0.0252329 -0.0261142 -0.0306366 0.0485394 0.072881 0.0628261 0.0016058 -0.0853627 -0.0635104 0.151569 -0.0002112 0.0594041 0.028576 0.002637 -0.0028844 0.0026441 0.1136632 0.0684245 -0.0253854 0.106136 -0.002869 0.0386455 0.0183302 0.078498 0.063947 -0.0439228 0.067176 -0.0377219 -0.0986187 -0.0052582 0.0536654 -0.0197869 -0.0740498 -0.0651971 -0.0142822 0.1974863 0.0326657 0.0018451 0.0967915 0.1935558 -0.0777186 0.0073771 -0.0808278 0.343065 0.2658834 0.0351641 -0.002102 -0.0052358 0.1716747 -0.0826619 0.0056801 -0.0696056 0.3405187 0.2970971 0.007071 -0.0009697 -0.0511941 0.1527959 0.0141122 0.0079219 0.0161118 0.3879879 0.2354427 0.0399672 -0.0043701 0.1132342 0.1928514 0.0128811 -0.0149371 0.0105115 0.3904566 unknown
polarizability: 216.0165767|0.3406411|134.5721777|-1.4904296|-0.6335436|63.4682409 unknown
InChI: InChI=1S/C7H9N5S/c1-3-5-6(12-7(9)10-3)13-2-4(8)11-5/h2,8-9H2,1H3
charge 0 multiplicity 1
22 atoms
S  -1.096998 2.277392 -0.159027
N  -1.492611 -0.891181 -0.178086
N  1.478112 1.408233 -0.052528
N  2.207751 -0.921118 0.088555
N  -3.803617 -0.589056 -0.244817
N  3.755061 0.842477 -0.009547
C  -0.180759 -0.399174 -0.01272
C  0.197838 0.978274 -0.045936
C  0.908076 -1.331298 0.070222
C  -2.451423 1.260452 0.690593
C  -2.535739 -0.121709 0.05682
C  0.640875 -2.813914 0.127334
C  2.44046 0.431197 0.008202
H  -3.379815 1.843013 0.583754
H  -2.191193 1.176865 1.759623
H  1.595484 -3.361475 0.132899
H  0.059992 -3.074958 1.030903
H  0.026204 -3.127559 -0.735154
H  -3.888009 -1.514899 -0.662431
H  -4.637644 -0.03758 -0.066464
H  4.489219 0.142088 0.037942
H  3.965034 1.834633 -0.067636
