program: Gaussian 09
title: 000216668
version: EM64L-G09RevD.01
frameworkgroup: C1[X(C18H34O4)]
method: RPBEPBE
basis: SDD
operation: Freq
keyword: #pfreq=noraman
keyword: PBEPBE/SDD
title: #p freq=noraman PBEPBE/SDD
converged: YES YES NO NO
title: Mulliken charges:
elementType: O O O O C C C C C C C C C C C C C C C C C C H H H H H H H H H H H H H H H H H H H H H H H H H H H H H H H H H H
charge: -0.257020 -0.257062 -0.239086 -0.238797 -0.386291 -0.388947 -0.379283 -0.377237 -0.382665 -0.384421 -0.443631 -0.443352 0.012257 0.012664 0.029700 0.029945 -0.388457 -0.388309 -0.328839 -0.328903 -0.715774 -0.715900 0.190543 0.198267 0.198635 0.190863 0.189093 0.199041 0.188539 0.199303 0.229928 0.179774 0.230117 0.179772 0.212201 0.226266 0.212170 0.226445 0.176804 0.176585 0.181179 0.180889 0.195971 0.226142 0.226246 0.195810 0.181050 0.231038 0.180918 0.231084 0.227789 0.201460 0.233126 0.227721 0.201499 0.233144
chargesum: 0.00000
title: Mulliken charges with hydrogens summed into heavy atoms:
elementType: O O O O C C C C C C C C C C C C C C C C C C
charge: -0.257020 -0.257062 -0.239086 -0.238797 0.002519 0.000551 0.008850 0.010605 0.027037 0.025468 -0.005164 -0.004737 0.189060 0.189249 0.210879 0.210834 0.033655 0.033746 0.083249 0.083100 -0.053399 -0.053537
polarizability: 2.77354602e+02 1.13470120e+00 1.79079682e+02 -8.12987201e-02 -4.11964042e-02 1.72999410e+02
1716.lowfreq: -14.7865 -13.5134 -0.0021 0.0017 0.0020 0.5950 2.6672 10.2897 18.6148
frequency: -13.7323 10.2877 18.2674 30.5084 49.7221 62.8172 68.0763 93.3476 105.6905 113.1014 115.0320 144.0785 144.7721 150.5676 153.6465 162.7789 184.9804 198.4439 211.0691 222.3791 238.2839 282.7612 283.6047 285.5853 303.0295 346.3587 391.9514 409.8295 415.0879 418.0021 448.3183 479.0746 479.7565 496.7931 499.0965 544.6655 545.4879 631.3319 633.7862 722.5730 724.8876 731.8960 750.3374 782.4004 795.5909 796.8853 824.3626 853.1133 853.9992 868.7810 876.7309 885.4111 929.2572 933.2592 940.8298 961.4401 963.6274 977.4076 978.4021 994.4623 1006.8557 1008.4005 1028.0424 1033.4373 1047.2779 1059.0427 1076.6775 1080.2191 1081.2991 1082.9263 1084.2665 1092.4132 1107.4920 1130.5786 1132.7895 1151.9742 1154.0474 1169.8002 1179.2228 1204.6953 1206.4287 1208.6096 1209.8569 1223.3966 1229.6401 1242.1736 1248.2249 1269.7699 1273.9038 1282.2083 1287.6282 1290.3295 1295.6240 1296.1494 1299.2326 1301.3420 1302.7087 1308.6475 1328.4526 1338.0068 1340.4290 1348.4296 1353.6519 1355.9772 1357.0838 1359.5570 1362.0937 1362.3828 1381.9262 1382.3730 1390.4083 1390.5966 1434.8449 1435.2383 1451.5103 1452.2747 1457.9647 1458.2503 1462.5011 1463.1305 1463.4132 1464.3026 1467.5031 1476.1091 1478.4081 1478.5630 1484.6485 1489.3310 2864.7689 2864.8583 2906.6634 2907.9211 2930.2842 2930.9555 2949.6878 2950.6092 2952.7800 2958.0282 2962.5363 2965.4806 2985.0591 2988.9029 2988.9415 2993.1827 2993.2711 2993.3063 3000.2090 3000.4576 3008.1724 3025.1291 3036.3133 3042.5957 3062.6205 3062.6619 3068.8580 3069.2158 3083.6856 3084.3792 3088.5286 3088.5602 3097.7451 3097.7645
redmass: 3.6543 4.0050 4.1184 4.0862 3.9152 3.9006 1.7029 3.4031 1.7124 3.1387 5.2245 2.0988 2.6292 3.0124 2.7273 2.5668 1.5250 1.1928 1.5896 2.5241 3.4524 2.9261 2.2716 2.0785 2.8372 2.9107 3.0096 3.5459 5.2125 4.9378 2.4947 2.7585 3.4320 2.7420 2.7417 3.1080 3.1608 3.0851 3.0385 1.0742 1.1643 1.3514 1.5709 1.8063 2.6568 2.6224 1.7557 2.4504 2.4405 1.9890 2.7720 2.0342 3.8399 3.3590 1.4059 1.5488 1.4564 1.6892 1.8062 4.6252 3.8206 1.2559 3.6653 3.9488 3.9233 3.1452 2.1988 2.1493 2.0504 2.2414 2.8999 2.1977 2.6538 1.9842 1.8833 1.8818 1.9788 2.1049 2.0172 1.4216 1.3641 1.4132 1.3125 1.2607 1.2865 1.2985 1.3431 1.2836 1.2001 1.0446 1.0956 1.1894 1.1427 1.1172 1.1365 1.2718 1.2437 1.2693 1.3283 1.2595 1.2518 1.3630 1.4251 1.4892 1.7187 1.6194 1.3491 1.3360 1.4825 1.4715 1.4671 1.4746 1.0968 1.0967 1.0830 1.0830 1.0473 1.0471 1.0709 1.0717 1.0892 1.0923 1.0773 1.0947 1.0499 1.0499 1.0990 1.1004 1.0824 1.0825 1.0828 1.0828 1.0695 1.0695 1.0588 1.0589 1.0598 1.0620 1.0647 1.0626 1.0951 1.0400 1.0398 1.0566 1.0689 1.0829 1.0609 1.0603 1.0980 1.0994 1.0999 1.1027 1.1008 1.1008 1.1030 1.1029 1.0956 1.0956 1.0993 1.0993 1.1001 1.1001
irintensity: 0.3034 1.0384 0.7724 0.1943 0.4309 1.2053 0.0861 1.8411 0.0018 0.6183 0.1926 0.8617 2.0805 0.0071 2.0071 0.7942 0.6465 0.2167 0.2476 6.3070 2.4489 1.9382 1.9103 3.7712 0.2046 4.6711 1.6598 0.2431 5.6764 1.2326 2.7953 2.8563 2.6552 0.8387 10.8472 3.5711 1.2048 1.4314 2.9870 10.5023 4.3788 4.4443 11.6856 26.5910 11.4864 6.4152 10.1524 3.2630 13.4348 0.1242 19.9769 68.3914 151.1040 9.7184 0.0727 16.0686 4.6666 26.2807 5.4897 0.7110 26.9520 6.9293 3.9291 65.0556 10.1376 5.6897 44.8226 6.0356 1.7829 30.6012 9.0345 160.4214 8.8664 45.2500 3.1814 43.4981 27.2927 5.8084 1.4894 7.7979 8.3789 7.2962 14.9339 9.7956 8.7807 0.1025 7.6302 2.4447 0.3945 2.6917 2.0556 0.0821 44.0965 10.0870 3.0271 0.1942 2.2001 1.1103 18.5486 5.6506 37.7028 4.8910 21.9140 9.1227 0.7749 3.3038 0.7349 0.7026 48.0450 11.2098 15.8354 7.6827 9.0650 8.7365 5.1956 5.7748 11.1975 11.2828 0.2536 0.8226 8.8975 9.8307 0.0003 1.1110 7.3229 8.1941 0.1710 28.3518 64.8684 64.9824 48.6282 46.6269 87.8124 88.4869 1.1983 0.2297 3.4410 2.9139 5.8307 183.4825 5.6992 11.9259 11.8032 64.6665 31.2745 6.2626 44.9686 0.4617 9.9841 14.0577 1.7147 109.9999 28.3582 25.5038 2.8000 126.2297 33.0836 34.3721 39.3840 34.8257 21.8787 41.1633
temp: 298.150 k
press: 1.00000 atm
elementType: 8 8 8 8 6 6 6 6 6 6 6 6 6 6 6 6 6 6 6 6 6 6 1 1 1 1 1 1 1 1 1 1 1 1 1 1 1 1 1 1 1 1 1 1 1 1 1 1 1 1 1 1 1 1 1 1
symmnumber: 1
zpe: 1302008.7 jmol-1
zpe.correction: 0.495909 hartree
zpe.thermalcorrener: 0.520208 hartree
zpe.thermalcorrenthalpy: 0.521152 hartree
zpe.thermalcorrgfe: 0.439203 hartree
zpe.sumelectzpe: -1005.377187 hartree
zpe.sumelectthermal: -1005.352888 hartree
zpe.sumelectthermalent: -1005.351943 hartree
zpe.sumelectthermalfe: -1005.433892 hartree
dipole: 0.0035 -0.0011 -1.0759
dipole: 1.0760
quadrupole: -85.0609 -137.2355 -136.8590
quadrupole: -25.0076 0.1241 0.0128
quadrupole: 34.6575 -17.5170 -17.1405 -25.0076 0.1241 0.0128
hfenergy: -1005.8730956 hartree
pointgroup: C01 [X(C18H34O4)]
dipole: 0.0148303 -0.4069328 0.1156689 debye
polarizability: 277.1996386|3.6596515|173.5634366|-2.0171125|1.4959332|178.6706189 unknown
InChI: InChI=1S/C18H34O4/c1-15-11-13-19-17(21-15)9-7-5-3-4-6-8-10-18-20-14-12-16(2)22-18/h15-18H,3-14H2,1-2H3
charge 0 multiplicity 1
56 atoms
O  6.940465 -0.503801 -0.673533
O  -6.827104 -0.605062 0.955486
O  5.880469 1.423908 0.341409
O  -5.921336 0.625209 -0.924852
C  0.701317 -0.130925 0.409312
C  -0.621763 -0.392969 -0.344906
C  1.959423 -0.371983 -0.45432
C  -1.873161 -0.22634 0.545984
C  3.276014 -0.075332 0.297317
C  -3.198674 -0.453577 -0.213867
C  4.527049 -0.373837 -0.557146
C  -4.431604 -0.362763 0.711791
C  5.829479 -0.029796 0.154203
C  -5.749722 -0.526654 -0.0335
C  8.253971 -0.190779 -0.046391
C  -8.152679 -0.761169 0.296367
C  8.352218 1.333937 0.186029
C  -8.379101 0.423992 -0.669249
C  7.13919 1.814188 1.00719
C  -7.199589 0.522227 -1.657329
C  9.324637 -0.750064 -0.981369
C  -9.186121 -0.859879 1.416764
H  0.744815 -0.783115 1.307139
H  0.708371 0.913725 0.784572
H  -0.692906 0.295542 -1.212592
H  -0.606816 -1.421025 -0.764491
H  1.963665 -1.424863 -0.807579
H  1.908419 0.260998 -1.364719
H  -1.809755 -0.935393 1.398415
H  -1.876338 0.791484 0.988874
H  3.298233 0.986077 0.610073
H  3.308493 -0.681579 1.227511
H  -3.300672 0.292295 -1.025053
H  -3.173425 -1.451719 -0.700638
H  4.564269 -1.44577 -0.828992
H  4.497867 0.2048 -1.499413
H  -4.386271 -1.144708 1.49322
H  -4.457105 0.616436 1.225719
H  5.909528 -0.511108 1.162823
H  -5.77876 -1.454898 -0.660193
H  8.292445 -0.708691 0.941737
H  -8.130201 -1.707991 -0.294785
H  9.29333 1.579696 0.716455
H  8.359278 1.845482 -0.794058
H  -8.446928 1.357607 -0.08095
H  -9.329265 0.28906 -1.222874
H  7.167464 1.375049 2.030682
H  7.099213 2.912063 1.089691
H  -7.174875 -0.374931 -2.317407
H  -7.252877 1.426988 -2.283618
H  9.258387 -0.264004 -1.970634
H  10.334099 -0.573685 -0.567116
H  9.184863 -1.835752 -1.12131
H  -9.180808 0.062927 2.023144
H  -10.199641 -1.003306 0.999765
H  -8.953476 -1.709823 2.081011
