program: Gaussian 09
title: 000211451
version: EM64L-G09RevD.01
frameworkgroup: C1[X(C11H13NO2)]
method: RPBEPBE
basis: SDD
operation: Freq
keyword: #p
keyword: freq=noraman
keyword: PBEPBE/SDD
title: #p freq=noraman PBEPBE/SDD
converged: YES YES NO NO
title: Mulliken charges:
elementType: O O N C C C C C C C C C C C H H H H H H H H H H H H H
charge: -0.443835 -0.248232 -0.175013 0.118993 -0.521157 -0.529502 0.161353 0.412416 -0.629870 -0.394172 -0.403124 -0.232029 -0.213443 -0.241545 0.254215 0.257450 0.244994 0.259777 0.261165 0.248469 0.244859 0.347119 0.249107 0.285721 0.228772 0.227467 0.230044
chargesum: 0.00000
title: Mulliken charges with hydrogens summed into heavy atoms:
elementType: O O N C C C C C C C C C C C
charge: -0.096716 -0.248232 -0.175013 0.118993 -0.009493 -0.024731 0.161353 0.412416 0.124623 -0.145064 -0.117403 -0.003257 0.014024 -0.011501
polarizability: 1.66316371e+02 -6.62796235e-01 1.14058283e+02 -7.46531330e+00 9.97479048e+00 9.28955800e+01
1716.lowfreq: -13.3148 -0.0010 -0.0005 0.0006 8.4419 11.7482 45.6611 63.1434 91.2502
frequency: 45.4823 63.1015 91.2484 120.9584 136.6332 172.0187 222.2621 258.7098 287.3185 320.0385 329.7350 360.8610 392.2971 405.0621 483.6218 519.3307 548.3329 567.5561 616.6832 630.9153 661.2577 676.1661 708.4681 762.0673 791.3272 863.6906 866.9915 907.5791 935.6838 964.8298 987.4380 990.7266 996.9967 1004.3360 1027.3201 1039.8879 1055.1424 1085.0217 1108.8155 1126.6682 1147.7898 1156.5503 1172.7000 1187.8075 1203.5708 1233.7928 1260.6751 1290.1708 1312.3908 1344.4639 1363.5968 1384.6484 1420.6870 1436.4923 1457.6441 1472.2154 1474.6487 1483.1733 1490.2130 1594.3293 1614.9994 1645.6010 2988.0028 3014.1324 3038.2870 3075.2747 3084.6398 3104.7542 3105.7824 3116.7083 3128.8652 3142.5814 3160.3043 3181.6020 3556.0885
redmass: 4.1176 5.1320 3.6597 1.0644 2.2779 3.4217 4.3908 3.2332 2.9140 1.7345 2.4125 3.8674 4.6813 2.8792 3.8759 4.7017 3.3944 3.2174 6.4090 5.3677 5.0167 5.7242 1.8787 1.6476 1.8084 1.2843 3.3121 2.4259 1.4346 2.5070 1.3970 5.8920 1.9521 1.5395 2.2191 2.0555 4.4963 1.5320 3.0661 1.3446 1.2926 1.7730 1.0603 1.1634 1.6745 2.3483 1.4104 1.5034 1.3617 2.4914 3.0226 8.5765 1.2157 2.1840 1.0816 1.0930 1.0508 2.3496 1.0730 6.4095 6.1448 10.4724 1.0329 1.0648 1.0622 1.1018 1.0987 1.1036 1.1007 1.0870 1.0873 1.0934 1.0990 1.0953 1.0658
irintensity: 0.1735 3.0733 0.5596 0.0824 2.1434 6.4824 3.0992 4.1187 19.5943 60.0608 31.9822 10.9119 37.7134 0.2502 3.1495 6.4462 4.7303 10.8757 0.0882 17.5285 13.9859 3.2592 46.9041 52.1330 24.0872 3.3361 45.3125 52.7642 8.2104 43.8992 1.0278 0.7581 12.8372 4.2016 6.5173 41.5975 1.7333 0.9374 111.4856 11.8384 49.2096 13.6563 0.3429 2.6675 11.3093 21.2805 17.1985 0.7668 2.2069 26.0615 176.1651 3.0057 55.4500 23.1057 3.3848 12.1937 17.0655 10.5136 21.5046 0.3875 2.3893 364.5820 36.9512 18.7511 13.9862 19.7851 4.7940 15.8027 2.5956 6.0079 2.0441 29.6253 26.4343 5.5944 7.1200
temp: 298.150 k
press: 1.00000 atm
elementType: 8 8 7 6 6 6 6 6 6 6 6 6 6 6 1 1 1 1 1 1 1 1 1 1 1 1 1
symmnumber: 1
zpe: 574074.5 jmol-1
zpe.correction: 0.218653 hartree
zpe.thermalcorrener: 0.231490 hartree
zpe.thermalcorrenthalpy: 0.232434 hartree
zpe.thermalcorrgfe: 0.179304 hartree
zpe.sumelectzpe: -631.153355 hartree
zpe.sumelectthermal: -631.140519 hartree
zpe.sumelectthermalent: -631.139574 hartree
zpe.sumelectthermalfe: -631.192705 hartree
dipole: -2.1704 1.7477 -0.9380
dipole: 2.9402
quadrupole: -89.9567 -80.1534 -80.2063
quadrupole: 12.4362 -1.1849 0.7545
quadrupole: -6.5179 3.2854 3.2325 12.4362 -1.1849 0.7545
hfenergy: -631.3720088 hartree
pointgroup: C01 [X(C11H13N1O2)]
dipole: -0.8955835 0.4580751 -0.5711545 debye
polarizability: 165.0226208|-4.0756522|117.8672435|-11.7750178|-1.879045|90.3803699 unknown
InChI: InChI=1S/C11H13NO2/c1-12-10(13)7-8-11(12,14)9-5-3-2-4-6-9/h2-6,14H,7-8H2,1H3
charge 0 multiplicity 1
27 atoms
O  0.581419 2.144901 0.103766
O  3.661996 -0.998345 0.398349
N  1.505149 -0.052115 0.563757
C  0.53313 0.708958 -0.247594
C  1.037183 0.453221 -1.711456
C  2.520497 0.036661 -1.579394
C  2.668566 -0.419909 -0.120022
C  -0.912694 0.262704 -0.016807
C  1.360796 -0.210021 2.01498
C  -1.216412 -1.122386 -0.022174
C  -1.956297 1.200782 0.157493
C  -2.546702 -1.563646 0.142037
C  -3.289216 0.757942 0.321078
C  -3.589964 -0.622804 0.312378
H  0.872822 1.356872 -2.320546
H  0.447399 -0.363221 -2.158343
H  3.228961 0.867103 -1.757975
H  2.809945 -0.782853 -2.256776
H  2.312919 -0.608201 2.402869
H  0.544581 -0.911831 2.260979
H  1.143113 0.765268 2.484948
H  1.495628 2.480387 -0.082494
H  -0.407985 -1.854219 -0.145918
H  -1.712392 2.2659 0.169618
H  -2.769599 -2.636485 0.139754
H  -4.091559 1.492131 0.455592
H  -4.623585 -0.96389 0.438997
