program: Gaussian 09
title: 000211447
version: EM64L-G09RevD.01
frameworkgroup: C1[X(C17H21NO4S)]
method: RPBEPBE
basis: SDD
operation: Freq
keyword: #p
keyword: freq=noraman
keyword: PBEPBE/SDD
title: #p freq=noraman PBEPBE/SDD
converged: YES YES NO NO
title: Mulliken charges:
elementType: S O O O O N C C C C C C C C C C C C C C C C C H H H H H H H H H H H H H H H H H H H H H
charge: 0.254350 -0.283994 -0.294613 -0.288166 -0.286439 -0.394644 -0.252076 0.104836 0.144283 0.195626 0.200573 -0.128310 0.114921 0.127240 -0.809417 -0.817978 -0.277711 -0.148983 -0.524399 -0.251041 -0.248344 -0.669920 -0.669333 0.305370 0.306186 0.211271 0.246728 0.314766 0.231526 0.324047 0.230807 0.250286 0.238598 0.257859 0.230934 0.222673 0.222064 0.232647 0.224920 0.214033 0.250330 0.249887 0.214057 0.224551
chargesum: 0.00000
title: Mulliken charges with hydrogens summed into heavy atoms:
elementType: S O O O O N C C C C C C C C C C C C C C C C C
charge: 0.254350 -0.283994 -0.294613 -0.288166 -0.286439 -0.088458 0.053294 0.104836 0.144283 0.195626 0.200573 -0.128310 0.114921 0.127240 -0.036652 -0.031599 -0.027425 0.089615 -0.266539 0.202566 0.206366 0.019363 0.019162
polarizability: 2.42993789e+02 1.59753720e+01 2.47481286e+02 3.44075161e+00 -8.04873406e+00 1.96810309e+02
1716.lowfreq: -6.4804 0.0014 0.0015 0.0022 1.5691 5.7839 18.0702 28.4003 33.8829
frequency: 18.0410 28.3077 33.8469 37.8391 45.1333 50.1337 53.2263 62.6529 66.6933 85.1825 90.5302 103.7954 105.7459 117.0161 165.8307 189.5587 207.4789 214.2663 219.7549 246.7607 277.8370 290.1256 324.5078 330.3603 343.1087 347.5061 354.0297 388.5106 391.7034 426.5712 456.3483 479.4371 542.1025 557.9304 561.2146 573.7525 582.3299 602.0920 623.6443 667.6550 678.4111 693.2699 697.2643 714.2201 731.1095 733.8308 777.3762 798.9099 811.9950 818.7937 820.7078 833.3624 837.3354 841.6256 905.6532 955.7139 969.3508 1000.4872 1019.9056 1026.4432 1038.2876 1048.6364 1050.2680 1052.6266 1068.8726 1091.8204 1095.3107 1101.5620 1105.5407 1143.2715 1151.7305 1155.8641 1198.2986 1219.1105 1254.9427 1278.6385 1279.2093 1294.0540 1301.0597 1306.6079 1312.3724 1347.9221 1355.4612 1357.2985 1386.7513 1387.4878 1393.6226 1401.1889 1434.4465 1448.7718 1454.5031 1455.9007 1461.3848 1461.9607 1475.9222 1479.2017 1484.7547 1485.1847 1488.6011 1495.8509 1544.9644 1581.2655 1593.6175 1637.6862 1655.5144 2970.1770 2973.6315 2990.4620 2990.9713 3027.2571 3028.1411 3044.4040 3047.1534 3077.4107 3085.2137 3085.7404 3090.8856 3091.5111 3116.4467 3117.0181 3129.5195 3131.2414 3164.7642 3182.8500 3231.7747 3540.1936
redmass: 5.7393 3.4512 3.3862 4.9073 2.6338 1.3032 1.5347 2.8954 3.9901 3.4748 4.0930 3.7864 3.2380 3.5265 2.2814 3.5219 3.0985 1.5444 1.8618 2.5878 3.5558 2.5110 3.8773 3.9711 3.9944 5.0424 6.1955 5.5581 6.0520 3.5031 3.6884 5.3117 3.1979 3.7501 5.4762 2.9572 4.5908 2.4822 2.2174 5.9387 5.2033 1.2045 7.7567 5.3662 4.8764 4.0855 2.5953 3.0681 1.4195 1.9823 3.2902 2.5147 3.3514 1.7794 1.3815 1.7130 3.0607 2.7296 2.2925 3.7756 1.7940 2.3647 2.5603 1.5370 1.5341 2.5179 2.1314 3.1043 1.6377 3.4761 1.6665 1.7811 1.9133 1.4936 4.3411 1.1173 1.1188 1.6713 3.2359 2.8348 2.3505 1.8341 1.3125 1.3404 1.2357 1.2359 1.2429 1.2454 1.3157 1.0928 1.1022 1.0971 1.0457 1.0434 4.6035 1.6838 1.0529 1.0517 1.1175 1.0573 5.4248 7.1603 8.2360 4.0319 7.8020 1.0398 1.0401 1.0360 1.0360 1.0592 1.0590 1.0972 1.0973 1.0830 1.0976 1.0976 1.1032 1.1032 1.1058 1.1055 1.0961 1.0957 1.0891 1.0970 1.1003 1.0772
irintensity: 0.0104 0.0155 0.6100 0.5753 0.2847 1.0480 0.4076 5.9491 1.0937 0.1011 0.3467 0.1350 1.6405 0.2076 2.4214 2.5527 0.3170 4.5140 0.7172 0.0427 0.5176 2.6513 4.7112 15.3096 0.7485 5.3704 13.8405 5.1393 8.2384 1.1502 5.7344 2.9318 0.7891 2.4071 2.5947 8.9349 1.5046 26.9875 31.3215 7.3291 0.6196 90.2085 6.8782 17.6937 3.5694 4.8537 7.1559 8.5274 4.8877 2.1981 5.2641 4.9770 1.9606 4.1906 0.0622 1.4486 18.8549 18.5282 21.2907 152.5350 49.2915 199.5692 318.3632 9.2840 5.9501 79.4258 18.0679 28.6343 1.5556 94.8146 28.9047 24.4985 182.0522 36.4432 238.7544 5.4741 2.9098 2.5507 14.2896 26.5856 41.7103 4.0277 2.5037 3.9523 16.1297 42.2940 81.8957 54.6644 325.8776 7.9096 20.2776 9.3743 10.2055 17.5528 25.0835 80.7614 31.7155 3.3279 34.0482 22.5306 0.9250 484.8583 45.2615 1.8659 246.4439 31.3184 43.5927 22.7204 28.6767 30.6363 30.6671 14.5217 18.9973 0.3464 42.9761 35.4576 3.1207 2.5117 23.3485 33.0518 6.1329 2.5052 9.2283 5.3692 2.4254 43.6056
temp: 298.150 k
press: 1.00000 atm
elementType: 16 8 8 8 8 7 6 6 6 6 6 6 6 6 6 6 6 6 6 6 6 6 6 1 1 1 1 1 1 1 1 1 1 1 1 1 1 1 1 1 1 1 1 1
symmnumber: 1
zpe: 914320.4 jmol-1
zpe.correction: 0.348246 hartree
zpe.thermalcorrener: 0.373247 hartree
zpe.thermalcorrenthalpy: 0.374191 hartree
zpe.thermalcorrgfe: 0.289842 hartree
zpe.sumelectzpe: -1412.395175 hartree
zpe.sumelectthermal: -1412.370175 hartree
zpe.sumelectthermalent: -1412.369231 hartree
zpe.sumelectthermalfe: -1412.453579 hartree
dipole: 0.5295 1.7491 -0.4442
dipole: 1.8807
quadrupole: -153.0169 -114.7808 -138.3068
quadrupole: 5.0484 0.4663 1.1050
quadrupole: -17.6488 20.5874 -2.9386 5.0484 0.4663 1.1050
hfenergy: -1412.7434215 hartree
pointgroup: C01 [X(C17H21N1O4S1)]
dipole: -0.1472537 -0.6230421 0.3709608 debye
polarizability: 240.4891937|8.4100087|231.4632928|-13.1646466|-26.6860985|215.3328977 unknown
InChI: InChI=1S/C17H21NO4S/c1-5-21-16(19)13-10(3)18-11(4)14(17(20)22-6-2)15(13)12-8-7-9-23-12/h7-9,15,18H,5-6H2,1-4H3
charge 0 multiplicity 1
44 atoms
S  1.029159 2.617233 0.528195
O  -2.239136 0.537886 -1.35894
O  2.265709 0.482284 -1.479966
O  -3.627272 -0.995603 -0.285054
O  3.700024 -1.039498 -0.452002
N  0.069321 -2.334912 1.643391
C  0.044505 -0.067432 -0.015231
C  -1.217217 -0.90644 0.220101
C  1.318651 -0.913484 0.183524
C  -1.177175 -1.9553 1.122225
C  1.304501 -1.95198 1.097591
C  0.048045 1.139931 0.923369
C  -2.46976 -0.511664 -0.452333
C  2.539162 -0.549269 -0.559722
C  -2.328774 -2.815721 1.591643
C  2.473384 -2.779438 1.582389
C  -0.617157 1.31857 2.129289
C  -0.373395 2.593099 2.762968
C  0.483121 3.408923 2.04365
C  -3.42769 1.038495 -2.106162
C  3.413964 0.958849 -2.301703
C  -3.673726 0.203274 -3.36666
C  3.570402 0.106887 -3.56521
H  0.031029 0.307265 -1.049267
H  0.077652 -3.087137 2.334606
H  -2.24538 -3.01522 2.677747
H  -2.324161 -3.791746 1.068597
H  -3.289283 -2.330014 1.375371
H  2.568005 -2.69484 2.683029
H  3.405929 -2.434205 1.117328
H  2.32862 -3.849231 1.336182
H  -1.281836 0.558487 2.546564
H  -0.821731 2.889246 3.714776
H  0.840914 4.409682 2.280285
H  -4.303207 1.012685 -1.433857
H  -3.161031 2.080588 -2.345778
H  3.14855 2.002553 -2.535951
H  4.327012 0.926591 -1.681946
H  -2.774068 0.181204 -4.005972
H  -4.502942 0.644354 -3.950945
H  -3.950272 -0.830383 -3.100223
H  3.848089 -0.928062 -3.304752
H  4.368353 0.529027 -4.204474
H  2.632812 0.091366 -4.147667
