program: Gaussian 09
title: 000216702
version: EM64L-G09RevD.01
frameworkgroup: C1[X(C19H31NO)]
method: RPBEPBE
basis: SDD
operation: Freq
keyword: #p
keyword: freq=noraman
keyword: PBEPBE/SDD
title: #p freq=noraman PBEPBE/SDD
converged: YES YES NO NO
title: Mulliken charges:
elementType: O N C C C C C C C C C C C C C C C C C C C H H H H H H H H H H H H H H H H H H H H H H H H H H H H H H H
charge: -0.439357 -0.057688 0.247933 -0.492596 -0.527261 -0.414326 -0.447340 0.471033 -0.368294 -0.366814 -0.393124 -0.577875 -0.426678 -0.361833 -0.699433 0.284406 -0.221371 -0.352046 -0.376706 -0.355543 -0.696297 0.184870 0.235941 0.202822 0.233854 0.229739 0.172067 0.198087 0.202083 0.211000 0.167630 0.230685 0.191268 0.208623 0.202944 0.230964 0.234875 0.186221 0.184432 0.218692 0.207051 0.210184 0.224305 0.189854 0.186128 0.251670 0.194213 0.195144 0.350744 0.215257 0.209380 0.210481
chargesum: 0.00000
title: Mulliken charges with hydrogens summed into heavy atoms:
elementType: O N C C C C C C C C C C C C C C C C C C C
charge: -0.088613 -0.057688 0.247933 -0.071785 -0.090585 -0.012520 -0.047170 0.471033 0.010336 0.055139 0.018443 -0.346911 -0.191803 0.008820 -0.063505 0.284406 0.002934 0.023937 -0.125036 0.033814 -0.061179
polarizability: 2.68526991e+02 -2.11638288e+01 1.81911211e+02 6.07807331e+00 7.56220535e+00 1.95677848e+02
1716.lowfreq: -13.1444 -7.3105 -1.2566 -0.0008 -0.0005 -0.0003 6.3677 25.2982 32.3737
frequency: -8.4778 25.1228 32.3074 43.2414 52.9697 60.8661 78.4927 89.3183 108.4414 118.7410 125.8144 138.5640 140.7122 174.1915 178.8110 218.2238 227.0266 230.1844 236.4506 265.7287 278.6211 297.3503 303.6735 323.3555 338.9927 350.7337 401.5157 432.8057 439.2580 451.5551 487.6173 514.2931 524.5251 615.3510 625.5112 644.9885 701.2480 715.2205 724.1055 742.6803 743.7430 791.6631 792.5047 812.5853 827.2729 853.0324 864.3044 881.8890 882.1708 886.0185 890.4515 893.0290 932.5193 969.2598 978.5720 984.1051 985.2194 990.0148 1006.5934 1013.3707 1036.0200 1044.7031 1060.0902 1066.2425 1080.4088 1085.3912 1094.7202 1110.8835 1112.9036 1122.5044 1136.5997 1140.8884 1160.9539 1170.7516 1180.1136 1190.5804 1194.6544 1206.1983 1224.5396 1235.2863 1238.3500 1243.5547 1257.4505 1268.8463 1278.2698 1287.8139 1288.2410 1290.3007 1295.8292 1297.2576 1316.0898 1318.1568 1333.7068 1339.8128 1347.7307 1351.2316 1354.8928 1383.7828 1385.6863 1387.9236 1389.0956 1428.9797 1451.2076 1461.3483 1462.1470 1463.7890 1466.7608 1473.3339 1474.6026 1476.5982 1478.0513 1482.8580 1484.6787 1488.0998 1488.4837 1493.6587 1500.0408 1605.7362 1612.2518 2804.4852 2831.3660 2891.3208 2950.4807 2953.6026 2955.3596 2966.8064 2970.6267 2971.5047 2973.5534 2974.4771 2987.2925 2996.2517 3001.7797 3003.9694 3006.0257 3011.1937 3027.1251 3033.3188 3037.3787 3046.2581 3068.0038 3068.6935 3069.9719 3070.8594 3071.8614 3111.4748 3130.9084 3153.8797 3174.7714 3578.8385
redmass: 4.2349 3.1199 3.7467 2.4048 2.3877 2.3570 2.4747 2.5239 2.2486 2.6720 2.2756 2.1502 2.6574 3.7870 4.0881 2.8341 1.8491 1.7661 1.1095 3.0052 3.0350 2.5100 2.5749 2.6754 3.6672 1.1312 3.2181 3.1348 2.9336 3.2437 3.0233 3.7888 5.4723 3.3379 4.0059 4.3966 2.0263 2.8715 1.0670 1.1111 1.2149 1.3088 1.2985 2.7867 3.4276 1.6216 1.4735 1.4103 2.0862 1.4163 1.8711 1.6902 2.2391 1.3294 1.7485 1.6310 3.5190 1.9610 2.8035 1.8612 2.6296 2.5788 2.3885 2.5208 2.1587 1.7727 1.9709 1.9388 2.1465 2.3226 2.5402 1.4496 1.5928 1.4778 1.3146 2.1115 1.5733 1.7122 1.4686 1.4531 1.3811 1.5574 1.3258 1.6579 1.0977 1.2882 1.1879 1.1810 1.1807 1.2616 1.3647 1.4438 1.4271 1.4461 1.4967 1.5141 1.6571 7.5928 1.4777 1.2132 1.2182 2.8715 1.0886 1.0827 1.0901 1.0668 1.0765 1.0573 1.0732 1.0447 1.0429 1.0815 1.1062 1.1333 1.1002 1.8164 1.1870 6.1616 6.3952 1.0709 1.0711 1.0708 1.0588 1.0587 1.0589 1.0590 1.0356 1.0368 1.0639 1.0609 1.0970 1.0848 1.0622 1.1006 1.0959 1.0896 1.1033 1.0889 1.0991 1.1033 1.1007 1.1010 1.1045 1.0993 1.0991 1.0901 1.0865 1.0933 1.0972 1.0659
irintensity: 0.0529 0.1644 0.0121 0.0082 0.0912 0.0850 0.0753 0.5803 0.0411 0.2621 0.3227 0.4259 0.1020 0.5944 0.1718 2.7980 0.3046 0.3099 0.0082 0.9454 1.1916 0.5207 3.1462 0.7959 0.6260 136.1844 11.6615 1.4266 7.7076 6.8320 4.6674 2.8705 1.2485 2.0724 0.7204 0.6761 28.7869 6.2939 11.3091 1.5730 11.8944 13.1737 24.1088 10.3417 8.5090 23.0277 6.3083 1.8906 10.2464 4.2738 5.9858 6.9374 11.7870 0.7133 3.6231 6.2293 0.3030 3.5251 1.6790 3.6466 1.2154 1.8631 3.0421 0.5101 1.8023 23.6436 38.5350 31.5518 1.1776 14.0038 9.1730 177.1553 22.5759 20.3599 7.9950 11.1414 2.4893 3.4669 16.5665 3.3036 4.2418 7.2839 2.8945 7.7720 4.3482 1.2312 0.5400 0.9060 0.2352 1.9896 1.4378 23.3226 2.2415 1.2611 6.8663 0.4727 2.3231 4.6484 7.8576 10.9808 12.9632 62.3831 9.1396 1.3422 4.4867 0.3015 3.0531 2.4933 0.2026 12.0249 12.3027 5.1451 6.5292 7.8673 15.7680 6.2998 18.1013 100.8258 39.0327 82.7836 112.4336 86.7666 2.1740 22.0819 13.6612 64.4510 53.6075 34.6990 21.5371 56.2037 1.7944 34.3838 19.1766 0.4000 23.2668 46.8107 13.3805 46.9769 17.8039 102.5566 94.5022 78.7341 39.0703 55.9018 46.9297 14.7866 11.2693 15.9924 9.8899 29.5922
temp: 298.150 k
press: 1.00000 atm
elementType: 8 7 6 6 6 6 6 6 6 6 6 6 6 6 6 6 6 6 6 6 6 1 1 1 1 1 1 1 1 1 1 1 1 1 1 1 1 1 1 1 1 1 1 1 1 1 1 1 1 1 1 1
symmnumber: 1
zpe: 1204827.6 jmol-1
zpe.correction: 0.458895 hartree
zpe.thermalcorrener: 0.481612 hartree
zpe.thermalcorrenthalpy: 0.482556 hartree
zpe.thermalcorrgfe: 0.405779 hartree
zpe.sumelectzpe: -870.923975 hartree
zpe.sumelectthermal: -870.901257 hartree
zpe.sumelectthermalent: -870.900313 hartree
zpe.sumelectthermalfe: -870.977090 hartree
dipole: -1.4126 1.4340 -1.2948
dipole: 2.3934
quadrupole: -141.4072 -135.4571 -120.1473
quadrupole: 2.2133 -3.8629 3.4159
quadrupole: -9.0700 -3.1199 12.1899 2.2133 -3.8629 3.4159
hfenergy: -871.3828692 hartree
pointgroup: C01 [X(C19H31N1O1)]
dipole: -0.4902196 -0.6995217 0.3962593 debye
polarizability: 263.0517216|30.6098834|185.2552638|-1.9266321|4.8388084|197.8090644 unknown
InChI: InChI=1S/C19H31NO/c1-3-5-6-7-13-20-14-12-19(16-20,11-4-2)17-9-8-10-18(21)15-17/h8-10,15,21H,3-7,11-14,16H2,1-2H3
charge 0 multiplicity 1
52 atoms
O  5.387787 2.594147 1.573839
N  -1.015538 0.106932 0.046678
C  1.412999 -0.218779 0.304872
C  0.226867 -0.187159 -0.72813
C  0.714661 0.251899 1.630722
C  -0.745941 -0.202449 1.468242
C  1.919477 -1.694402 0.517027
C  2.608222 0.667019 -0.083388
C  -2.239912 -0.477557 -0.532299
C  2.585905 -2.385593 -0.693998
C  -3.531196 0.027745 0.142422
C  3.423234 1.236846 0.929236
C  2.979233 0.881096 -1.436875
C  -4.806592 -0.521372 -0.535537
C  2.985608 -3.843315 -0.375564
C  4.560867 2.007323 0.595429
C  4.118249 1.654168 -1.761191
C  -6.109022 -0.038441 0.141735
C  4.919509 2.226157 -0.752913
C  -7.388338 -0.590877 -0.52751
C  -8.684742 -0.100021 0.15256
H  0.152019 -1.170818 -1.249918
H  0.364591 0.589029 -1.503347
H  1.188625 -0.17737 2.532421
H  0.744545 1.353814 1.703731
H  -1.432495 0.351361 2.132864
H  -0.856632 -1.294018 1.702179
H  2.645409 -1.688673 1.356522
H  1.05602 -2.308487 0.847363
H  -2.269606 -0.20491 -1.606132
H  -2.217454 -1.601294 -0.487412
H  3.481045 -1.81331 -1.001053
H  1.896029 -2.378404 -1.56222
H  -3.532435 1.135257 0.114001
H  -3.537212 -0.264301 1.211969
H  3.166362 1.085525 1.986183
H  2.384823 0.441601 -2.244137
H  -4.815984 -0.217711 -1.603506
H  -4.781385 -1.63164 -0.528184
H  3.473394 -4.324995 -1.242805
H  2.101338 -4.450853 -0.103818
H  3.693445 -3.883811 0.474089
H  4.385396 1.811288 -2.812237
H  -6.13957 1.071144 0.12957
H  -6.098875 -0.336514 1.211298
H  5.802257 2.829471 -0.983124
H  -7.357538 -1.699686 -0.511562
H  -7.395558 -0.296268 -1.596957
H  5.049322 2.396481 2.482308
H  -9.583944 -0.510088 -0.343156
H  -8.715068 -0.406675 1.215344
H  -8.755003 1.003787 0.12117
