program: Gaussian 09
title: 000216604
version: EM64L-G09RevD.01
frameworkgroup: C1[X(C11H12ClNO2)]
method: RPBEPBE
basis: SDD
operation: Freq
keyword: #p
keyword: freq=noraman
keyword: PBEPBE/SDD
title: #p freq=noraman PBEPBE/SDD
converged: YES YES NO NO
title: Mulliken charges:
elementType: Cl O O N C C C C C C C C C C C H H H H H H H H H H H H
charge: -0.052714 -0.309022 -0.273046 -0.349315 -0.264022 -0.403540 -0.396117 0.391389 -0.307000 0.209481 -0.428363 -0.340429 -0.231603 -0.089900 -0.061591 0.282980 0.212076 0.237845 0.221623 0.212470 0.227095 0.206389 0.342555 0.250133 0.281188 0.258975 0.172464
chargesum: 0.00000
title: Mulliken charges with hydrogens summed into heavy atoms:
elementType: Cl O O N C C C C C C C C C C C
charge: -0.052714 -0.309022 -0.273046 -0.006760 0.018958 0.046381 0.037976 0.391389 0.126483 0.209481 -0.178230 -0.059241 0.027372 -0.089900 0.110873
polarizability: 1.88390236e+02 -4.34436343e-01 1.31776195e+02 -3.49934891e+00 -1.44109498e+01 9.56198635e+01
1716.lowfreq: 0.0023 0.0029 0.0033 3.7447 7.6390 11.9397 26.7440 58.9390 65.9749
frequency: 26.6578 58.8964 65.9577 134.7364 165.1013 175.9850 198.6912 209.6062 247.4899 304.9211 309.8034 318.8684 393.2996 396.9204 433.0965 478.9280 483.5254 547.4352 583.2676 603.4742 640.8852 660.6527 694.0085 748.4543 768.5647 803.9198 822.7096 833.5352 868.5437 886.8740 923.9729 947.4709 954.8685 958.5965 965.3394 1025.0921 1062.8404 1094.7480 1106.2845 1116.9064 1167.6511 1176.1229 1202.6975 1211.5938 1221.2902 1244.5306 1267.1879 1304.4891 1313.3188 1347.5907 1360.7696 1363.0968 1366.6375 1380.4713 1400.7673 1454.5605 1456.2821 1459.6470 1465.0992 1474.6239 1577.7341 1596.8051 1629.7726 2939.2059 2982.4844 2987.2864 2990.7812 3035.3012 3041.7591 3054.6522 3082.0749 3137.9984 3176.6628 3180.2666 3522.1687
redmass: 9.7848 4.8313 6.1302 3.1226 4.6787 7.5353 7.1810 3.2139 4.5486 3.3076 2.7802 4.5490 3.6374 3.6185 6.2658 3.4256 3.1748 3.9719 2.5964 4.5371 1.3864 3.0373 6.1515 3.4474 4.7413 2.6725 1.7143 2.5762 1.8743 1.6402 2.5727 1.8081 2.6876 1.8504 1.6612 3.0844 1.9692 2.1031 2.0637 2.0872 1.6040 2.1105 1.7008 1.6469 1.5443 1.3520 1.1702 1.2937 1.8090 1.3324 1.2841 1.4022 2.1478 2.2590 2.7100 1.1077 1.1062 1.7189 1.3739 1.7366 8.1598 7.1474 5.8573 1.0869 1.0606 1.0635 1.0640 1.0873 1.0958 1.1012 1.1032 1.0902 1.0950 1.0937 1.0789
irintensity: 5.5949 3.5958 4.7011 0.4212 5.8135 1.8102 5.4925 13.9562 5.4684 7.1859 7.7972 6.7118 1.3602 5.0745 19.5392 11.5048 13.9002 10.7380 3.6194 5.5086 62.1412 38.9169 1.3193 1.7186 22.2523 6.6456 29.8549 7.2726 12.8260 22.6967 87.3644 25.1239 35.1483 31.3030 21.3664 19.4924 22.3245 9.9130 8.9920 24.7760 8.3421 36.6397 36.3896 25.4359 14.5313 7.8940 7.5705 15.3707 14.5344 10.9214 21.3677 9.7199 6.0667 0.6627 11.9290 15.1034 10.5174 145.9892 127.4521 67.6157 15.8385 67.8667 323.6177 111.4018 22.6580 32.4622 40.2372 8.3826 27.9900 40.3509 36.3679 5.1275 1.9257 0.3724 33.2556
temp: 298.150 k
press: 1.00000 atm
elementType: 17 8 8 7 6 6 6 6 6 6 6 6 6 6 6 1 1 1 1 1 1 1 1 1 1 1 1
symmnumber: 1
zpe: 553837.0 jmol-1
zpe.correction: 0.210945 hartree
zpe.thermalcorrener: 0.224372 hartree
zpe.thermalcorrenthalpy: 0.225316 hartree
zpe.thermalcorrgfe: 0.169705 hartree
zpe.sumelectzpe: -1090.521780 hartree
zpe.sumelectthermal: -1090.508353 hartree
zpe.sumelectthermalent: -1090.507409 hartree
zpe.sumelectthermalfe: -1090.563021 hartree
dipole: -0.1320 3.5801 0.5887
dipole: 3.6305
quadrupole: -111.7938 -95.5678 -90.5211
quadrupole: -15.3516 3.7540 0.5410
quadrupole: -12.4995 3.7264 8.7731 -15.3516 3.7540 0.5410
hfenergy: -1090.7327255 hartree
pointgroup: C01 [X(C11H12Cl1N1O2)]
dipole: 0.0632827 -1.4021643 -0.264865 debye
polarizability: 187.7224544|4.981303|132.8548548|6.8221569|-13.069632|95.2089852 unknown
InChI: InChI=1S/C11H12ClNO2/c12-8-3-4-9-10(13-7-14)2-1-5-15-11(9)6-8/h3-4,6-7,10,13H,1-2,5H2
charge 0 multiplicity 1
27 atoms
Cl 4.750959 0.674159 0.38142
O  0.165207 -1.724968 0.895405
O  -3.535229 2.132484 0.21269
N  -1.993224 0.476628 0.818789
C  -1.353037 0.369305 -0.515183
C  -1.888029 -0.861446 -1.308967
C  -1.850691 -2.201413 -0.542874
C  0.166251 0.407225 -0.356278
C  -0.450753 -2.651412 -0.10311
C  0.860238 -0.616653 0.344317
C  0.918758 1.505137 -0.835764
C  2.249675 -0.544718 0.57809
C  2.314046 1.600097 -0.627414
C  2.953921 0.56978 0.086963
C  -3.019857 1.362205 1.072945
H  -1.673704 1.272992 -1.0640
H  -1.309817 -0.942358 -2.250837
H  -2.936211 -0.645297 -1.58854
H  -2.505022 -2.141021 0.347587
H  -2.273595 -2.997871 -1.188153
H  -0.498798 -3.617981 0.426029
H  0.233863 -2.745043 -0.96953
H  -1.626138 -0.116424 1.56856
H  0.403652 2.313327 -1.367272
H  2.745914 -1.346754 1.130207
H  2.88207 2.456543 -1.000035
H  -3.35495 1.329675 2.134756
