program: Gaussian 09
title: 000211446
version: EM64L-G09RevD.01
frameworkgroup: C1[X(C17H21NO5)]
method: RPBEPBE
basis: SDD
operation: Freq
keyword: #p
keyword: freq=noraman
keyword: PBEPBE/SDD
title: #p freq=noraman PBEPBE/SDD
converged: YES YES NO NO
title: Mulliken charges:
elementType: O O O O O N C C C C C C C C C C C C C C C C C H H H H H H H H H H H H H H H H H H H H H
charge: -0.242552 -0.293256 -0.292953 -0.281849 -0.281909 -0.430659 -0.361152 0.140540 0.141505 0.229167 0.229289 0.404133 0.098552 0.097822 -0.759101 -0.759280 -0.416444 -0.269683 -0.183748 -0.255025 -0.254931 -0.667250 -0.667251 0.301647 0.289317 0.187550 0.266761 0.273305 0.187453 0.273216 0.266953 0.256302 0.248100 0.252415 0.215579 0.231387 0.231320 0.215567 0.250952 0.210840 0.227802 0.228092 0.210717 0.250761
chargesum: 0.00000
title: Mulliken charges with hydrogens summed into heavy atoms:
elementType: O O O O O N C C C C C C C C C C C C C C C C C
charge: -0.242552 -0.293256 -0.292953 -0.281849 -0.281909 -0.141341 -0.059505 0.140540 0.141505 0.229167 0.229289 0.404133 0.098552 0.097822 -0.031486 -0.031659 -0.160142 -0.021583 0.068667 0.191940 0.191956 0.022343 0.022320
polarizability: 2.38483615e+02 -3.25142465e-01 2.43792006e+02 -1.41117400e-01 9.21916287e+00 1.67399130e+02
1716.lowfreq: -3.7096 -0.0010 -0.0008 -0.0006 1.8787 6.6099 24.0690 29.0390 35.0840
frequency: 23.9803 29.0285 35.0245 35.8010 40.1262 65.9072 66.0867 76.9178 87.4201 98.5892 103.7752 109.8517 112.2416 117.0306 154.9473 199.7461 208.5661 216.7500 235.8944 239.5798 276.9732 292.8075 323.6961 325.2301 341.0702 369.5873 373.0189 380.2122 386.0515 426.7483 463.8326 553.0920 571.4500 577.8497 593.0143 611.4064 622.5111 630.4073 683.4416 687.9530 712.1021 716.5841 734.4220 740.0285 782.7722 789.4070 811.2022 812.2310 823.7426 838.2052 843.2131 871.3604 872.5511 882.1446 970.6626 972.7521 997.2864 1005.0372 1020.6932 1028.1352 1033.9045 1038.4338 1042.8181 1046.4377 1093.6041 1095.7155 1106.0945 1130.6088 1134.2741 1151.2975 1154.4638 1179.5336 1200.4709 1210.6838 1259.9217 1278.9390 1279.0419 1298.6646 1305.7599 1312.8844 1314.1025 1356.4140 1356.4682 1372.6344 1387.2423 1387.4510 1406.2724 1411.3797 1438.9114 1441.1699 1452.4414 1454.0732 1459.8780 1459.9938 1464.6130 1465.6191 1477.1512 1482.8955 1483.9921 1484.2032 1575.2689 1576.0138 1590.5609 1631.5603 1645.0415 2987.7707 2988.3820 2990.4350 2990.5091 3023.6996 3023.9083 3080.7390 3081.1320 3081.2340 3085.0436 3085.2052 3088.7841 3088.8440 3103.6292 3104.1474 3115.0026 3115.1459 3215.8185 3234.6654 3263.4493 3550.9104
redmass: 4.6618 4.0106 3.2934 3.2769 3.8752 3.9681 3.6176 4.4577 2.1995 2.8422 3.9942 1.7794 1.4410 2.1138 2.0740 1.3302 2.9587 1.4260 4.9751 5.3040 3.9074 2.7266 3.2075 3.3943 6.6577 4.6028 5.8292 6.5793 5.1553 3.3980 3.7996 3.8271 4.0259 3.0872 3.0770 1.6704 2.8923 5.5586 4.6062 8.2480 4.0651 1.2822 6.4908 4.1326 1.9953 5.9319 1.3333 1.3453 1.9610 3.5410 2.9746 6.0837 1.4281 4.3374 3.3330 1.6636 2.6273 1.6679 1.9970 2.8851 1.5300 1.5388 2.6471 6.1773 2.3202 2.1418 3.5067 1.6614 3.9575 1.6576 1.7278 2.6821 1.7600 2.3583 4.8937 1.1193 1.1136 2.3506 2.2614 2.0777 2.2061 1.3612 1.3594 2.0810 1.2329 1.2333 1.2128 1.1749 1.0537 1.0473 1.1220 1.1071 1.0466 1.0448 1.1174 1.1255 2.4134 4.1303 1.0519 1.1059 7.0645 6.5927 8.6608 4.0933 9.0338 1.0398 1.0398 1.0362 1.0361 1.0588 1.0589 1.0976 1.0853 1.0962 1.0979 1.0979 1.1032 1.1032 1.0965 1.0964 1.1049 1.1049 1.0912 1.0994 1.1081 1.0774
irintensity: 0.6213 0.0501 0.2364 0.1482 0.1333 0.3493 6.7436 4.4170 0.0270 0.3127 0.1329 2.2234 0.1706 0.3221 2.5113 2.7279 2.6814 1.2113 0.0991 0.4459 0.8914 3.3489 19.7911 2.3163 1.6503 2.4554 2.3364 9.0289 6.2790 0.2966 3.5908 2.4406 0.2728 11.3532 6.2778 40.6715 20.9471 4.1382 0.0218 6.2803 18.1494 72.3812 0.2409 8.8053 7.8722 19.4269 2.0312 21.0264 4.1391 0.4061 0.7441 2.9600 0.0976 7.6794 39.1083 42.7716 8.9109 26.6634 128.5415 128.8739 14.0394 3.5615 1.2538 442.7072 48.1239 31.4421 51.1547 21.6533 34.1752 33.7878 37.0997 14.8236 226.9108 3.4363 249.5206 3.7012 0.2096 10.6010 0.0176 31.2829 13.3699 1.7609 7.8541 0.2407 27.3322 29.1852 122.1855 7.5786 20.6239 25.2259 72.8606 15.7950 14.6115 21.0196 1.1818 36.6014 390.1834 7.4324 19.7404 8.0534 552.2944 0.8638 26.1957 0.3309 216.0267 0.0205 67.8807 19.9446 26.1982 9.1642 74.9110 9.5383 2.0151 23.9293 37.0213 45.8287 5.7678 3.9756 4.8573 7.9771 13.7224 45.0793 5.5693 0.6172 1.2943 40.9474
temp: 298.150 k
press: 1.00000 atm
elementType: 8 8 8 8 8 7 6 6 6 6 6 6 6 6 6 6 6 6 6 6 6 6 6 1 1 1 1 1 1 1 1 1 1 1 1 1 1 1 1 1 1 1 1 1
symmnumber: 1
zpe: 922317.9 jmol-1
zpe.correction: 0.351292 hartree
zpe.thermalcorrener: 0.375677 hartree
zpe.thermalcorrenthalpy: 0.376622 hartree
zpe.thermalcorrgfe: 0.294509 hartree
zpe.sumelectzpe: -1089.548018 hartree
zpe.sumelectthermal: -1089.523633 hartree
zpe.sumelectthermalent: -1089.522689 hartree
zpe.sumelectthermalfe: -1089.604801 hartree
dipole: 0.0161 0.4492 0.9157
dipole: 1.0201
quadrupole: -145.2744 -108.1034 -128.9367
quadrupole: -0.1101 -0.0521 6.8254
quadrupole: -17.8363 19.3347 -1.4985 -0.1101 -0.0521 6.8254
hfenergy: -1089.8993102 hartree
pointgroup: C01 [X(C17H21N1O5)]
dipole: -0.006707 0.1378642 0.3768591 debye
polarizability: 238.4828974|-0.0891546|194.7536238|0.3509097|-37.7680218|216.4382298 unknown
InChI: InChI=1S/C17H21NO5/c1-5-21-16(19)13-10(3)18-11(4)14(17(20)22-6-2)15(13)12-8-7-9-23-12/h7-9,15,18H,5-6H2,1-4H3
charge 0 multiplicity 1
44 atoms
O  0.021951 1.38129 1.318327
O  -2.319306 -0.405366 -1.83583
O  2.322446 -0.4042 -1.836184
O  -3.662814 -1.447844 -0.231614
O  3.666538 -1.447295 -0.232793
N  0.002304 -1.9507 2.021626
C  0.001921 -0.451712 -0.380773
C  -1.263465 -1.132624 0.163272
C  1.267112 -1.133104 0.162275
C  -1.235874 -1.76021 1.397575
C  1.240048 -1.760996 1.396343
C  0.001541 1.026331 -0.054649
C  -2.520961 -1.033527 -0.588138
C  2.524555 -1.0332 -0.589104
C  -2.42265 -2.323067 2.147363
C  2.427171 -2.324623 2.144955
C  -0.018248 2.18234 -0.817286
C  -0.010203 3.309263 0.094152
C  0.013907 2.786651 1.375558
C  -3.533171 -0.224739 -2.680303
C  3.536172 -0.220585 -2.680131
C  -4.272164 1.063513 -2.30326
C  4.271884 1.069172 -2.301854
H  0.001306 -0.51331 -1.478946
H  0.002661 -2.371297 2.951505
H  -2.126253 -2.669123 3.155423
H  -2.872145 -3.168445 1.598461
H  -3.222765 -1.572015 2.240317
H  2.130687 -2.67476 3.151582
H  3.225903 -1.572449 2.241339
H  2.878618 -3.167089 1.593287
H  -0.037186 2.214912 -1.904408
H  -0.020845 4.365447 -0.169084
H  0.028172 3.218836 2.372273
H  -3.133493 -0.185973 -3.706996
H  -4.185552 -1.107389 -2.557574
H  4.190424 -1.101899 -2.557725
H  3.136779 -0.181957 -3.706934
H  -4.678686 0.992102 -1.280765
H  -5.114152 1.23104 -3.000994
H  -3.5960 1.934318 -2.357671
H  3.593189 1.938059 -2.355275
H  5.113343 1.239739 -2.999484
H  4.678701 0.997788 -1.27946
