program: Gaussian 09
title: 000211443
version: EM64L-G09RevD.01
frameworkgroup: C1[X(C19H19NO)]
method: RPBEPBE
basis: SDD
operation: Freq
keyword: #p
keyword: freq=noraman
keyword: PBEPBE/SDD
title: #p freq=noraman PBEPBE/SDD
converged: YES YES NO NO
title: Mulliken charges:
elementType: O N C C C C C C C C C C C C C C C C C C C H H H H H H H H H H H H H H H H H H H
charge: -0.269601 -0.149087 0.087390 0.338001 0.362317 -0.382825 -0.467352 -0.435191 0.500120 -0.369904 -0.577672 0.399064 0.322545 -0.383665 -0.438550 -0.362752 -0.371613 -0.373357 -0.644992 -0.646139 -0.536918 0.224665 0.214893 0.242075 0.229689 0.254080 0.244772 0.225793 0.224953 0.237355 0.236131 0.237780 0.236733 0.218503 0.238807 0.218839 0.236114 0.218811 0.241333 0.218855
chargesum: 0.00000
title: Mulliken charges with hydrogens summed into heavy atoms:
elementType: O N C C C C C C C C C C C C C C C C C C C
charge: -0.269601 -0.149087 0.087390 0.338001 0.362317 -0.158160 -0.225277 -0.220298 0.500120 -0.140215 -0.323592 0.399064 0.322545 -0.138893 -0.212756 -0.137799 -0.134259 -0.137226 0.048024 0.047621 0.142080
polarizability: 5.98539334e+02 -1.34110680e+01 2.08162750e+02 1.01631245e+00 -7.53092151e-01 1.02007169e+02
1716.lowfreq: -2.3574 -0.0006 0.0004 0.0010 3.3639 9.6586 22.9044 25.3114 53.0730
frequency: 22.8494 25.2960 53.0186 66.6458 84.0999 100.0548 117.7044 136.1287 157.5791 169.0489 186.2755 199.7758 223.3145 229.7662 247.8799 294.5940 307.7893 365.9534 371.1376 396.6628 420.5914 422.1531 439.8131 450.2379 471.7261 506.3176 525.1829 562.1749 577.3538 614.4495 629.5746 661.4729 708.8882 716.0161 728.5544 747.3794 762.6646 786.9864 793.3757 803.0341 819.6808 823.9839 835.2487 859.2770 909.9513 913.7645 918.9920 941.6263 947.1019 952.4280 957.4332 992.6711 994.1289 1030.1954 1056.1511 1076.2428 1107.1436 1110.9774 1111.4035 1116.5641 1137.4461 1147.3872 1158.1264 1166.6652 1199.4002 1208.0286 1236.3777 1258.3323 1267.2689 1282.3562 1312.2675 1327.9914 1361.7244 1370.0107 1386.9220 1410.0984 1423.1862 1430.2644 1448.4473 1453.0364 1459.4998 1462.8944 1464.4545 1464.4956 1476.2847 1476.5820 1493.0365 1505.4294 1511.7300 1530.2597 1545.3917 1588.2078 1611.8583 1614.5541 1638.5163 2943.8308 2951.0169 2953.4518 3011.6840 3014.2046 3038.6941 3071.8736 3098.9439 3108.6604 3118.6688 3118.6861 3121.7337 3151.0965 3151.6888 3162.3638 3166.6130 3170.0193 3178.2328 3213.0489
redmass: 4.0838 4.3180 3.6742 3.3043 2.7500 3.6545 1.7232 5.0712 2.6847 2.9524 3.5044 1.1518 3.1582 1.9573 1.5747 3.7781 3.7784 3.9737 4.1142 3.6918 3.3060 3.3107 2.8932 5.0146 3.6066 3.9336 2.1754 4.4219 5.8247 2.7598 7.0213 3.4146 5.5695 4.7529 2.5999 2.8810 6.0676 1.6142 4.4754 1.2743 1.7179 1.7758 4.5910 1.7026 1.4691 3.9902 1.3907 3.0344 1.3714 1.4323 1.3858 4.0690 3.2389 2.8256 1.5018 1.6461 1.2377 1.3238 1.2609 1.3162 1.5279 1.4943 1.5628 1.6972 1.7457 1.2547 2.6946 2.8716 1.4545 2.3330 1.8671 1.6377 3.0274 3.8193 4.2676 2.2547 1.6797 1.2458 2.3311 2.3008 1.2621 2.6726 1.0424 1.0570 1.0524 1.1944 1.1086 1.2400 3.2543 2.7080 5.9523 7.9040 6.6415 7.0229 6.6582 1.0370 1.0394 1.0331 1.0990 1.1027 1.1036 1.0867 1.0964 1.0944 1.0891 1.0987 1.0895 1.0910 1.0869 1.0934 1.0945 1.0911 1.0952 1.1003
irintensity: 0.1672 2.0437 0.7435 0.1130 0.1838 8.4723 0.9699 0.7991 0.3060 0.1253 2.2589 0.0796 1.7591 5.1026 2.5974 1.2570 0.6412 0.6195 0.4633 4.1649 1.4459 8.0985 13.6857 5.0714 2.8056 23.1147 29.5613 4.2179 6.9706 0.7784 0.5386 6.0664 1.1211 6.8954 17.6248 11.1452 40.0753 24.6066 10.7224 1.1847 38.6774 59.5169 19.5284 41.1210 20.8501 6.3380 5.2337 32.8097 0.0919 3.0825 4.0962 62.1534 17.9599 34.0497 25.3885 16.6506 0.0342 3.7160 0.2823 137.9487 5.3741 161.6642 92.0192 3.2550 65.0418 64.5454 46.3194 27.0018 58.8299 41.5640 10.1409 1.6979 120.9591 272.6672 17.4987 6.9049 44.2278 7.3840 1.1482 12.2103 14.6333 401.5722 1.7079 13.1274 24.0191 0.8431 5.2228 18.5003 31.7431 405.1602 2.3173 16.2243 637.6920 203.0596 123.3184 96.3747 239.3233 79.5116 0.3804 83.1935 53.8209 16.2856 4.0806 53.0135 5.8579 43.5548 11.7994 16.3933 12.4878 31.6469 13.6483 9.6495 7.0115 12.1518
temp: 298.150 k
press: 1.00000 atm
elementType: 8 7 6 6 6 6 6 6 6 6 6 6 6 6 6 6 6 6 6 6 6 1 1 1 1 1 1 1 1 1 1 1 1 1 1 1 1 1 1 1
symmnumber: 1
zpe: 856116.7 jmol-1
zpe.correction: 0.326078 hartree
zpe.thermalcorrener: 0.345429 hartree
zpe.thermalcorrenthalpy: 0.346373 hartree
zpe.thermalcorrgfe: 0.277189 hartree
zpe.sumelectzpe: -863.873283 hartree
zpe.sumelectthermal: -863.853932 hartree
zpe.sumelectthermalent: -863.852987 hartree
zpe.sumelectthermalfe: -863.922172 hartree
dipole: 5.7005 1.3951 -0.0918
dipole: 5.8694
quadrupole: -72.2358 -111.4973 -132.4787
quadrupole: -10.0642 1.3029 0.9210
quadrupole: 33.1681 -6.0934 -27.0748 -10.0642 1.3029 0.9210
hfenergy: -864.1993603 hartree
pointgroup: C01 [X(C19H19N1O1)]
dipole: 2.2492061 -0.4942294 -0.1709561 debye
polarizability: 598.1578229|17.2568357|193.0865597|5.6639497|37.5265735|117.4648702 unknown
InChI: InChI=1S/C19H19NO/c1-20(2)17-8-4-14(5-9-17)12-15-6-7-16-13-18(21-3)10-11-19(15)16/h4-13H,1-3H3
charge 0 multiplicity 1
40 atoms
O  -6.394671 0.557963 0.165345
N  6.020662 -0.085825 0.015246
C  -2.188001 0.113229 0.138365
C  -0.765807 -0.306359 0.043725
C  -3.007746 -1.015309 -0.192801
C  -0.798709 -1.730877 -0.344143
C  -2.113827 -2.147095 -0.477208
C  0.306917 0.529968 0.312908
C  1.74553 0.32134 0.196672
C  -2.795533 1.344877 0.460501
C  -4.417163 -0.92619 -0.201022
C  4.633159 0.054325 0.068394
C  -5.005949 0.321126 0.132264
C  -4.203058 1.44706 0.460731
C  2.622807 1.255234 0.831179
C  2.370829 -0.73441 -0.537778
C  4.017694 1.133338 0.783258
C  3.763799 -0.867244 -0.605237
C  6.886351 0.894211 0.684955
C  6.622593 -1.194027 -0.738807
C  -7.276192 -0.559836 -0.168129
H  0.074369 -2.374534 -0.449077
H  0.037432 1.528604 0.692284
H  -2.446091 -3.156495 -0.732383
H  -2.196319 2.228212 0.710987
H  -5.026315 -1.797565 -0.460002
H  -4.707644 2.385544 0.709265
H  2.185397 2.093649 1.388379
H  1.755102 -1.437238 -1.105039
H  4.631512 1.877775 1.297816
H  4.184073 -1.684225 -1.198774
H  6.688811 0.936027 1.774935
H  6.749996 1.915003 0.273229
H  7.940448 0.60922 0.543097
H  6.279119 -2.177768 -0.361244
H  7.718138 -1.156101 -0.634328
H  6.380792 -1.139312 -1.8200
H  -7.103243 -0.91755 -1.202517
H  -8.29703 -0.158489 -0.081907
H  -7.147029 -1.403058 0.539061
