program: Gaussian 09
title: 000211439
version: EM64L-G09RevD.01
frameworkgroup: C1[X(C21H30N2)]
method: RPBEPBE
basis: SDD
operation: Freq
keyword: #p
keyword: freq=noraman
keyword: PBEPBE/SDD
title: #p freq=noraman PBEPBE/SDD
converged: YES YES NO NO
title: Mulliken charges:
elementType: N N C C C C C C C C C C C C C C C C C C C C C H H H H H H H H H H H H H H H H H H H H H H H H H H H H H H
charge: -0.099373 -0.206453 -0.430416 -0.403086 -0.442385 -0.426707 -0.006292 -0.590771 -0.574578 0.532680 -0.625258 -0.732904 0.494124 -0.315136 -0.333624 -0.237925 -0.225203 -0.424333 -0.390273 -0.203036 -0.210339 -0.220769 -0.217242 0.293450 0.306104 0.318969 0.296995 0.308212 0.313458 0.301290 0.311304 0.288326 0.299823 0.288228 0.252403 0.249835 0.295169 0.299211 0.234525 0.256054 0.232031 0.315732 0.249716 0.243544 0.264051 0.277944 0.276816 0.242585 0.210113 0.286285 0.259397 0.252916 0.264817
chargesum: 2.00000
title: Mulliken charges with hydrogens summed into heavy atoms:
elementType: N N C C C C C C C C C C C C C C C C C C C C C
charge: -0.099373 -0.206453 0.169138 0.212877 0.179285 0.185888 0.282034 0.249682 0.269637 0.532680 -0.134680 0.064575 0.494124 -0.071592 -0.069574 0.040019 0.051612 -0.181748 -0.180160 0.083249 0.049058 0.032147 0.047575
polarizability: 3.29230094e+02 3.52793646e+00 1.80779637e+02 1.26084101e+01 -1.24747978e-01 1.76584637e+02
1716.lowfreq: -18.5246 -6.9097 -2.5495 -0.0007 0.0005 0.0007 22.0216 30.2331 38.5222
frequency: 21.7891 29.4016 38.3687 49.5329 60.1030 77.2644 103.1078 129.1422 160.0369 171.5457 183.3035 198.6672 226.8953 232.1946 254.5429 266.3923 278.1714 311.1742 322.4747 332.8725 348.5166 370.7501 398.9016 401.9147 404.8935 423.4637 431.2157 445.6965 456.8391 491.0779 505.6582 525.1966 537.4757 594.2005 606.9661 615.9907 632.8838 675.4449 684.1795 689.8797 706.3339 747.8558 760.9696 764.2666 789.9090 806.6404 816.3377 819.3832 848.8533 859.2261 876.1417 888.3452 907.8420 921.2938 925.7044 947.7075 982.4397 983.2248 984.6440 989.8292 991.6039 1001.6080 1014.3515 1015.1657 1017.3295 1021.5262 1024.6711 1025.5894 1053.0477 1059.7643 1064.8269 1088.0442 1100.0963 1105.7905 1132.7435 1139.7839 1164.7459 1166.7727 1172.2927 1178.2633 1184.7391 1192.1584 1196.3177 1201.3607 1211.2679 1225.3975 1251.5019 1278.6935 1293.5572 1297.1972 1311.4680 1319.8658 1332.7200 1337.8105 1344.9965 1360.4046 1368.2156 1382.1004 1386.3193 1389.0614 1402.8014 1408.2520 1431.1022 1438.5155 1444.4997 1445.9183 1451.7402 1455.2699 1460.2762 1461.2332 1467.6547 1470.6725 1472.8198 1476.4373 1480.6653 1483.4237 1484.4187 1491.7605 1496.9462 1583.2779 1595.5203 1605.8769 1606.2299 2993.4336 3002.5892 3004.5557 3032.9950 3038.3055 3039.1037 3044.7990 3045.5336 3053.6735 3061.5643 3091.6396 3094.9756 3106.9565 3111.2573 3113.7858 3120.3857 3123.7560 3125.8051 3141.1100 3148.1816 3149.3455 3152.9939 3159.0892 3159.1523 3162.4057 3163.2228 3171.4075 3179.3927 3180.5047 3191.3757
redmass: 4.5374 3.6414 4.0832 3.5711 3.6181 3.1675 3.8137 3.4887 1.2487 3.3339 1.1588 2.6223 2.2480 1.5743 3.1362 2.4364 2.4821 3.2225 2.7916 2.6348 2.3578 2.4249 2.5206 2.7913 2.2149 2.1916 2.1582 2.8294 3.0911 3.3769 2.9159 3.4722 3.3895 4.4713 6.3767 6.3055 3.3172 3.7337 2.7798 2.2594 1.9028 3.2202 1.7969 1.6600 1.7339 3.1278 3.5033 1.2886 1.2775 2.3488 2.5904 2.7062 1.4864 1.3828 1.3825 2.7646 1.4009 3.1640 1.6816 5.5152 2.1234 1.9790 1.3653 1.7352 2.0129 1.3667 2.5336 2.2426 1.7492 2.1774 2.3092 2.2885 1.5602 1.6269 1.9402 1.7364 1.7764 1.7420 1.7275 2.0215 1.0611 1.1091 1.0523 2.7610 1.1352 1.4845 1.2706 1.1739 1.2587 1.2747 1.2307 1.4140 1.3000 1.2853 1.2889 1.2514 1.2968 1.3562 6.2485 6.2714 1.2990 1.1914 1.1483 1.1563 2.0456 1.9142 1.0878 1.0688 1.1978 1.0771 1.2008 1.0905 1.1410 1.1804 1.5066 1.1774 1.3669 1.0764 1.0546 5.7515 5.9564 6.4080 6.0291 1.0593 1.0479 1.0759 1.0350 1.0382 1.0588 1.0616 1.0599 1.0626 1.1015 1.0967 1.0898 1.1023 1.1031 1.1036 1.1059 1.0904 1.1052 1.0906 1.1039 1.1055 1.0894 1.1052 1.1050 1.0884 1.0949 1.0921 1.0961 1.1012 1.1018
irintensity: 1.9742 0.4223 0.4501 0.1139 0.4931 0.7357 2.6455 1.9147 0.0135 0.6495 0.0339 1.2716 1.3560 0.6025 1.1997 1.1351 1.2132 0.6890 1.2078 0.4980 0.1966 0.2006 0.1050 0.0367 0.1559 0.7292 0.8684 5.3320 0.6868 0.8565 16.4414 9.2647 17.9273 6.3751 0.1493 0.3751 13.0545 7.9418 2.2079 43.6900 44.0734 78.8922 54.6529 57.1598 7.9168 111.5451 10.8050 0.1484 0.2747 2.1809 9.3621 1.2223 4.1048 0.5530 3.0016 21.4019 0.0383 11.1465 2.9442 6.9975 1.7664 6.4332 1.7733 11.1401 22.3072 0.3819 19.7665 15.7006 10.8990 4.7940 3.7621 3.3217 11.7095 11.4858 20.6816 0.5503 0.5719 4.0380 4.4749 1.8584 0.0042 0.3661 0.0911 1.8357 0.9121 2.6832 0.3545 0.6317 15.4110 16.6236 0.5849 0.5283 1.3141 0.7852 7.1719 0.7739 0.3101 6.6867 1.2870 5.1140 13.3591 27.5573 2.1010 45.8337 7.5728 27.2713 23.5070 20.9945 15.3288 16.0077 6.2163 7.9529 25.5766 32.9417 21.5092 28.4574 5.0583 109.3805 10.7719 2.2328 3.6689 10.2648 0.5766 36.4716 13.2337 6.2770 7.6503 8.0594 0.8197 1.2712 1.1434 0.6012 13.0494 1.1660 26.6415 12.6989 0.6892 2.4420 0.3405 8.2574 0.3508 6.0125 5.4691 16.3878 0.7172 0.2885 1.0234 0.7700 9.0561 2.2742 1.0805 4.5942 0.5595
temp: 298.150 k
press: 1.00000 atm
elementType: 7 7 6 6 6 6 6 6 6 6 6 6 6 6 6 6 6 6 6 6 6 6 6 1 1 1 1 1 1 1 1 1 1 1 1 1 1 1 1 1 1 1 1 1 1 1 1 1 1 1 1 1 1
symmnumber: 1
zpe: 1230340.4 jmol-1
zpe.correction: 0.468612 hartree
zpe.thermalcorrener: 0.490658 hartree
zpe.thermalcorrenthalpy: 0.491602 hartree
zpe.thermalcorrgfe: 0.417158 hartree
zpe.sumelectzpe: -925.397303 hartree
zpe.sumelectthermal: -925.375257 hartree
zpe.sumelectthermalent: -925.374313 hartree
zpe.sumelectthermalfe: -925.448757 hartree
dipole: 8.5896 1.5261 -0.7762
dipole: 8.7586
quadrupole: -3.5686 -112.6533 -114.7283
quadrupole: -6.5255 0.6190 0.0930
quadrupole: 73.4148 -35.6699 -37.7449 -6.5255 0.6190 0.0930
hfenergy: -925.8659147 hartree
pointgroup: C01 [X(C21H30N2)]
dipole: 3.3893883 0.6124768 -0.1055236 debye
polarizability: 329.216191|-3.0013922|180.4925819|12.8355187|0.9564703|176.8855947 unknown
InChI: InChI=1S/C21H30N2/c1-19(18-20-10-6-4-7-11-20)22(2)14-16-23(3,17-15-22)21-12-8-5-9-13-21/h4-13,19H,14-18H2,1-3H3
charge 2 multiplicity 1
53 atoms
N  -0.368516 0.691691 0.430027
N  2.44236 -0.238949 -0.493874
C  0.100609 -0.771816 0.437482
C  0.464578 1.42348 -0.633403
C  1.616147 -0.948049 0.593945
C  1.980709 1.237518 -0.488692
C  -1.930981 0.731199 -0.01844
C  -0.198746 1.335998 1.803014
C  2.224118 -0.907632 -1.861636
C  3.956897 -0.295123 -0.181656
C  -2.843518 0.019579 1.017859
C  -2.394582 2.163169 -0.31782
C  -4.218982 -0.244511 0.396339
C  4.819367 0.486545 -0.983601
C  4.458329 -1.145432 0.826926
C  6.210739 0.428185 -0.751598
C  5.855744 -1.191767 1.043961
C  -5.34586 0.516809 0.794183
C  -4.376564 -1.255999 -0.58619
C  6.731714 -0.408619 0.262152
C  -6.61209 0.272944 0.214807
C  -5.640813 -1.498597 -1.166642
C  -6.760678 -0.730874 -0.769285
H  -0.28087 -1.235226 -0.487793
H  -0.380247 -1.285488 1.284537
H  0.25174 2.500991 -0.553339
H  0.096915 1.084473 -1.616971
H  1.973113 -0.566366 1.563758
H  1.838949 -2.026285 0.545759
H  2.466341 1.754382 -1.330389
H  2.380552 1.676885 0.439882
H  -1.918553 0.139342 -0.955722
H  -0.739468 0.739389 2.550689
H  -0.615764 2.352215 1.77243
H  0.864083 1.391546 2.079678
H  1.158819 -0.909613 -2.134271
H  2.800741 -0.358721 -2.619043
H  2.603341 -1.938487 -1.801202
H  -2.412067 -0.946877 1.340838
H  -2.963914 0.654951 1.913613
H  -2.371516 2.824076 0.56623
H  -3.453312 2.091346 -0.621974
H  -1.863634 2.645901 -1.154026
H  4.45483 1.134337 -1.788349
H  3.823174 -1.780094 1.449204
H  6.88275 1.032443 -1.367905
H  6.252551 -1.848263 1.82398
H  -5.24677 1.286514 1.569756
H  -3.523133 -1.882673 -0.882401
H  7.810733 -0.45314 0.435656
H  -7.479921 0.857286 0.536402
H  -5.758268 -2.289024 -1.914869
H  -7.742275 -0.922371 -1.213813
