program: Gaussian 09
title: 000216677
version: EM64L-G09RevD.01
frameworkgroup: C1[X(C22H26N2S2)]
method: RPBEPBE
basis: SDD
operation: Freq
keyword: #p
keyword: freq=noraman
keyword: PBEPBE/SDD
title: #p freq=noraman PBEPBE/SDD
converged: YES YES NO NO
title: Mulliken charges:
elementType: S S N N C C C C C C C C C C C C C C C C C C C C C C H H H H H H H H H H H H H H H H H H H H H H H H H H
charge: 0.189023 0.195772 -0.068401 -0.118280 -0.169306 -0.174237 -0.474896 -0.462590 -0.383752 -0.397710 -0.157205 -0.646803 -0.629921 0.551958 0.551063 -0.422889 -0.242307 -0.365479 -0.421424 -0.244892 -0.264373 -0.262145 -0.259526 -0.237080 -0.239355 -0.869763 0.230494 0.228867 0.224399 0.244670 0.213297 0.225550 0.230727 0.226419 0.182160 0.205899 0.219781 0.223884 0.198031 0.227619 0.207932 0.232891 0.245195 0.243860 0.252447 0.246037 0.254710 0.229713 0.229620 0.262271 0.259014 0.279032
chargesum: 0.00000
title: Mulliken charges with hydrogens summed into heavy atoms:
elementType: S S N N C C C C C C C C C C C C C C C C C C C C C C
charge: 0.189023 0.195772 -0.068401 -0.118280 0.061188 0.054630 -0.005827 -0.023743 0.073394 -0.009652 0.062576 0.002730 -0.189098 0.551958 0.551063 -0.422889 0.002888 -0.365479 -0.177564 0.007555 -0.264373 -0.016108 -0.004816 -0.007367 -0.009735 -0.069446
polarizability: 3.55104085e+02 6.38775989e+00 2.91731943e+02 6.21286053e+00 2.70644462e+01 1.97490606e+02
1716.lowfreq: -0.0016 -0.0012 -0.0011 3.9571 6.6018 9.5604 17.2362 35.7978 39.9329
frequency: 16.1316 35.7368 39.7077 47.5984 54.3479 85.4361 97.6191 114.9058 138.2445 166.2103 175.2454 184.1110 203.6201 210.1957 222.8589 238.1592 248.3813 262.1756 270.3879 300.5476 310.3254 314.5885 350.0090 353.6822 359.1790 374.8984 398.2273 418.0074 442.4672 450.4789 474.1420 487.6488 507.2867 529.2115 542.4640 559.2388 592.2415 615.4029 657.5697 665.8790 673.1139 689.7256 696.7917 732.5035 743.3826 748.5858 756.0910 767.8399 783.0173 808.4088 817.1713 818.5556 822.1590 855.1043 877.4565 891.7762 908.5048 917.0156 939.0162 952.7319 952.9976 968.2351 970.6260 977.3001 986.7243 991.5493 997.9653 1014.9970 1021.9293 1027.1739 1028.5979 1047.5881 1054.4200 1068.7791 1094.2087 1105.3682 1119.7928 1120.8548 1130.3374 1133.9209 1141.1316 1151.8331 1170.3726 1174.6804 1187.2227 1201.8196 1208.6941 1213.5726 1231.3001 1235.8091 1248.5195 1254.8394 1272.9947 1277.1031 1280.8230 1287.4258 1295.3980 1313.5903 1327.2087 1337.2581 1343.8474 1350.5152 1364.4877 1366.5186 1374.6866 1380.4941 1381.7538 1425.7019 1430.0731 1452.1615 1453.5900 1454.7710 1455.8424 1459.5099 1464.6711 1465.4144 1468.6047 1473.2612 1481.8283 1484.2496 1555.4610 1578.8838 1585.4095 1598.2249 2860.9330 2888.4836 2915.1380 2961.9297 2976.5680 3001.3230 3002.6128 3003.3206 3014.6716 3021.7152 3039.6137 3042.8093 3050.6188 3051.4475 3066.7777 3075.7455 3092.3827 3119.3940 3123.5023 3132.2079 3133.8277 3135.7466 3148.5516 3154.6450 3157.4893 3164.8053
redmass: 4.8381 3.7988 3.5226 4.9280 5.2357 5.0686 4.1837 4.7978 4.2000 2.9522 2.8379 3.2133 2.3607 1.1774 2.7041 1.3504 5.3751 4.9897 4.2678 3.6267 3.2428 3.7724 4.5582 5.3074 2.2594 3.1132 2.5406 3.6972 3.4521 3.1848 5.1385 4.4862 3.5395 4.5067 4.2039 5.8514 4.1666 3.4091 6.2343 6.4984 6.3955 4.7357 4.2750 3.7953 4.2827 4.0596 2.2187 1.9562 1.8505 3.7922 2.6310 1.4138 2.6555 1.9789 1.4174 2.0880 2.6546 1.9109 2.0592 1.3839 1.4427 1.1837 2.0062 2.4706 1.3230 1.4481 2.3570 2.2284 3.9176 2.8001 4.7789 2.4333 1.6424 2.0568 2.3770 2.3418 1.7528 1.5928 1.7950 1.9076 2.4176 1.1772 1.1141 1.4213 1.9366 1.5819 1.3690 1.5207 1.3631 1.6845 1.3760 1.4019 1.3535 1.3876 1.3734 1.4071 1.4655 1.5212 1.3703 1.7426 1.3978 1.5223 3.8509 1.3811 1.9821 4.7497 1.6459 2.0196 1.1603 1.3566 1.3529 1.0649 1.1450 1.0962 1.1531 1.9683 1.2111 1.1067 1.0817 1.0530 7.6634 6.2744 6.1184 6.6993 1.0682 1.0525 1.0686 1.0773 1.0697 1.0681 1.0806 1.0311 1.0653 1.0766 1.0868 1.0897 1.0969 1.0892 1.1015 1.1005 1.1015 1.1063 1.0856 1.1019 1.0873 1.0893 1.0944 1.0942 1.0923 1.1005
irintensity: 0.5864 1.6902 0.0395 0.1076 0.0988 1.1038 1.7676 0.1694 0.3309 0.1843 0.3279 0.5457 0.5988 0.2435 2.3398 0.3166 0.9515 2.1995 1.7393 0.5853 0.2815 4.9288 0.9085 0.9770 1.2075 0.1879 1.3230 4.1154 2.0663 2.1987 14.6693 12.6677 2.0999 7.5167 2.4205 4.5042 0.6055 11.9464 3.0829 4.9558 3.2349 7.3963 9.7920 2.5070 0.2864 3.2757 31.2148 34.9200 10.6944 17.0358 6.7035 38.6559 2.1117 1.6268 5.1146 3.8611 0.6597 1.1224 2.9471 0.3132 0.4641 7.7006 15.4964 9.5318 0.1389 11.3182 40.4065 6.4972 28.6565 23.6992 19.9156 3.0433 2.7104 7.7573 9.6117 51.8963 1.9425 2.8441 0.6704 9.6097 50.0908 0.4924 1.4719 9.6714 18.8569 2.0664 1.4216 6.4694 9.9433 5.1127 10.8109 2.8576 3.2242 2.6353 4.1563 14.0675 3.1136 2.3176 7.8030 12.9716 4.2957 0.6008 9.1888 3.5731 5.8271 1.1789 8.5639 8.9039 4.8630 75.5030 54.7482 10.7851 17.4809 10.2363 6.5102 14.0413 11.0863 16.5073 24.6849 6.0682 4.3847 1.7544 29.3930 2.0680 97.5696 112.8925 58.1063 9.2480 33.9631 1.5647 54.1915 15.4856 52.3544 53.5446 47.2942 44.4319 21.1381 14.1181 18.0314 33.1691 43.2719 15.2488 1.7941 11.2799 2.7613 11.1894 19.6485 13.4990 2.1320 27.5470
temp: 298.150 k
press: 1.00000 atm
elementType: 16 16 7 7 6 6 6 6 6 6 6 6 6 6 6 6 6 6 6 6 6 6 6 6 6 6 1 1 1 1 1 1 1 1 1 1 1 1 1 1 1 1 1 1 1 1 1 1 1 1 1 1
symmnumber: 1
zpe: 1127628.1 jmol-1
zpe.correction: 0.429491 hartree
zpe.thermalcorrener: 0.453125 hartree
zpe.thermalcorrenthalpy: 0.454069 hartree
zpe.thermalcorrgfe: 0.375938 hartree
zpe.sumelectzpe: -1757.618665 hartree
zpe.sumelectthermal: -1757.595031 hartree
zpe.sumelectthermalent: -1757.594087 hartree
zpe.sumelectthermalfe: -1757.672218 hartree
dipole: -0.9731 3.6222 0.3828
dipole: 3.7701
quadrupole: -167.2994 -164.8394 -164.9918
quadrupole: 2.1368 6.0865 6.8610
quadrupole: -1.5892 0.8708 0.7184 2.1368 6.0865 6.8610
hfenergy: -1758.0481563 hartree
pointgroup: C01 [X(C22H26N2S2)]
dipole: 1.3655019 0.2615991 -0.5168143 debye
polarizability: 292.5998137|-38.8463777|320.8221879|-26.3616757|-52.7556516|230.9046324 unknown
InChI: InChI=1S/C22H26N2S2/c1-23-16-7-8-17(23)14-24(13-16)20-11-15-5-3-4-6-21(15)26-22-10-9-18(25-2)12-19(20)22/h3-6,9-10,12,16-17,20H,7-8,11,13-14H2,1-2H3
charge 0 multiplicity 1
52 atoms
S  -2.781377 -2.285705 1.109558
S  -3.315731 4.043221 -0.311469
N  2.603835 2.047423 -0.499168
N  0.590719 0.033387 -0.979629
C  2.400757 0.923847 0.477932
C  2.575823 1.284764 -1.791026
C  3.36488 -0.214868 -0.002755
C  3.452281 0.003479 -1.547814
C  0.913527 0.505816 0.389974
C  1.09622 0.919053 -2.053928
C  -0.758978 -0.572299 -1.214281
C  3.848796 2.819276 -0.281357
C  -0.689853 -2.129832 -1.183571
C  -1.882357 0.091548 -0.38089
C  -0.182046 -2.745625 0.100822
C  -2.706897 -0.499603 0.614142
C  -2.080258 1.47646 -0.655905
C  -1.026749 -2.826167 1.237399
C  1.128119 -3.274657 0.21057
C  -3.686361 0.286797 1.281346
C  -3.043818 2.258238 0.007343
C  -3.865875 1.648194 0.989073
C  -0.589094 -3.411894 2.445646
C  1.579293 -3.869183 1.411335
C  0.719994 -3.939556 2.532039
C  -1.890572 4.469671 -1.456546
H  2.613021 1.269237 1.504971
H  2.947009 1.916669 -2.617353
H  4.355852 -0.110732 0.4759
H  2.963125 -1.207911 0.253746
H  3.048968 -0.860798 -2.103195
H  4.492662 0.171077 -1.880353
H  0.705583 -0.309911 1.105177
H  0.303933 1.388341 0.690944
H  0.539113 1.885249 -2.135607
H  1.005534 0.388142 -3.022039
H  -1.007129 -0.327562 -2.268098
H  3.928016 3.603779 -1.055483
H  4.786944 2.214695 -0.307385
H  3.79399 3.320077 0.70187
H  -0.024934 -2.42384 -2.015467
H  -1.705064 -2.52238 -1.400996
H  -1.444697 1.92917 -1.422139
H  1.789692 -3.226713 -0.662072
H  -4.305229 -0.181634 2.054091
H  -4.621149 2.229968 1.528357
H  -1.264493 -3.450025 3.30652
H  2.594166 -4.277939 1.471802
H  1.062908 -4.397075 3.466515
H  -1.950556 5.559406 -1.601582
H  -2.002628 3.964611 -2.428932
H  -0.927016 4.210815 -0.989227
