program: Gaussian 09
title: 000211437
version: EM64L-G09RevD.01
frameworkgroup: C1[X(C21H36N2)]
method: RPBEPBE
basis: SDD
operation: Freq
keyword: #p
keyword: freq=noraman
keyword: PBEPBE/SDD
title: #p freq=noraman PBEPBE/SDD
converged: NO YES NO NO
title: Mulliken charges:
elementType: N N C C C C C C C C C C C C C C C C C C C C C H H H H H H H H H H H H H H H H H H H H H H H H H H H H H H H H H H H H
charge: -0.119870 -0.128718 0.073291 -0.388037 -0.396772 -0.427076 -0.419866 0.020444 -0.471214 -0.465821 -0.595646 -0.553056 -0.413108 -0.415304 -0.401650 -0.654156 -0.743623 0.518365 -0.433512 -0.456406 -0.233443 -0.223585 -0.229599 0.247881 0.305749 0.316544 0.294347 0.308121 0.329190 0.285573 0.291901 0.300574 0.261849 0.230169 0.229793 0.231001 0.229305 0.246658 0.293496 0.290424 0.294404 0.279142 0.259298 0.256427 0.214687 0.214210 0.254944 0.257368 0.221128 0.292262 0.239778 0.270047 0.283725 0.229060 0.245916 0.255020 0.261325 0.266123 0.270924
chargesum: 2.00000
title: Mulliken charges with hydrogens summed into heavy atoms:
elementType: N N C C C C C C C C C C C C C C C C C C C C C
charge: -0.119870 -0.128718 0.321172 0.234256 0.205696 0.187687 0.172609 0.282292 -0.011252 -0.005515 0.234932 0.279788 0.058006 0.053849 0.076846 -0.122115 0.039209 0.518365 -0.187596 -0.201386 0.027883 0.042538 0.041325
polarizability: 2.33682884e+02 2.32206985e+01 2.35472339e+02 1.10201377e+01 -9.62116464e+00 1.96598307e+02
1716.lowfreq: -14.7312 0.0003 0.0004 0.0007 4.4386 8.2025 25.7408 37.9703 51.9261
frequency: 23.6238 36.9765 51.7405 59.8922 67.7101 109.7865 114.3327 124.2686 151.7237 190.3744 191.4378 212.2152 213.6670 226.1630 234.0238 259.5053 287.1136 297.4964 303.4671 317.6431 322.7890 328.8575 352.3745 366.2490 389.4996 403.4346 407.0694 421.7971 431.2107 445.4488 451.8681 481.7562 492.3298 496.4477 511.4357 539.9145 580.8681 616.4791 626.1678 644.7494 705.6940 709.6999 754.3594 766.2708 780.5973 783.4540 793.3140 807.0411 809.2556 843.4037 857.0690 863.8791 883.3019 887.5363 890.9944 900.0209 923.3281 927.3703 934.6486 943.6389 984.5349 986.7658 989.1802 991.5874 1010.0118 1010.7371 1015.5917 1025.5705 1033.8782 1038.3818 1055.7244 1063.5230 1079.5202 1081.2777 1082.5123 1084.7900 1108.3734 1111.7119 1122.7942 1134.9370 1165.0528 1169.4206 1176.5783 1181.7584 1184.3767 1193.2539 1198.9287 1209.8280 1222.3561 1244.3043 1246.7712 1261.4718 1263.9735 1282.1090 1288.4623 1296.2421 1306.5754 1313.3227 1318.2185 1321.7758 1326.8283 1334.3835 1341.5411 1342.7513 1350.5315 1355.2814 1362.6436 1367.9860 1373.6132 1380.2173 1381.1601 1406.4431 1414.4331 1428.5072 1438.0841 1443.0329 1450.1813 1452.5119 1456.4594 1461.9162 1464.7759 1467.8637 1468.8880 1470.6608 1474.7662 1475.7786 1479.1812 1481.3843 1483.6851 1486.0505 1489.0273 1493.9212 1496.7787 1589.5293 1606.0548 2981.6559 2988.2760 2989.1020 2994.9465 2996.4895 2997.8302 2998.4193 3005.4888 3026.6162 3034.4013 3036.9433 3039.2385 3040.8082 3043.6808 3046.2996 3051.6802 3060.1975 3064.8111 3067.2895 3069.2619 3076.7643 3094.0222 3101.9000 3104.5046 3107.2453 3108.2033 3111.7332 3112.9419 3118.8085 3145.0497 3150.5580 3150.7434 3160.3090 3160.4489 3163.7631 3178.5531
redmass: 4.4868 3.6900 2.8563 3.9853 3.5144 2.8971 3.1156 2.9404 2.3920 1.2992 2.1087 1.8866 3.1063 1.3439 3.2851 1.3161 2.6579 2.3994 2.7391 2.2861 2.0296 2.1044 2.2851 2.2153 1.9723 2.7531 2.5367 2.9808 2.3986 2.5919 3.0468 2.2600 2.9164 1.8407 3.0941 3.0308 3.8278 6.0871 2.7126 2.8581 3.1345 2.3815 1.4898 3.2715 1.7219 2.7362 1.4474 2.8158 2.9677 2.0958 1.8421 1.4437 2.0244 2.0999 2.0489 1.5282 2.0254 2.5793 1.4392 2.3028 1.7495 2.0555 2.2864 2.3426 1.8719 2.0036 1.3746 2.2771 2.2512 2.2933 1.5056 2.2309 1.9159 1.6597 1.7277 1.6974 1.6924 1.7977 1.9920 1.5936 2.0722 1.9753 1.6388 1.9025 1.0805 1.1161 1.6352 1.4368 1.7572 1.2638 1.2778 1.3246 1.2982 1.2211 1.1612 1.3030 1.2191 1.2522 1.2279 1.3243 1.3047 1.3068 1.3622 1.3461 1.3411 1.4393 1.3147 1.3383 1.3333 5.3159 1.2794 1.2659 1.1905 1.1646 1.2976 1.7065 1.0694 1.0884 1.0908 1.0878 1.0662 1.0805 1.0856 1.0791 1.0791 1.0844 1.0802 1.0513 2.1081 1.0698 1.0743 1.0668 1.0522 5.8468 5.9938 1.0842 1.0693 1.0665 1.0584 1.0621 1.0619 1.0601 1.0385 1.0656 1.0476 1.0525 1.0728 1.0585 1.0491 1.0718 1.0856 1.0996 1.1005 1.0950 1.1008 1.1032 1.0980 1.0906 1.0954 1.1007 1.1004 1.1007 1.1008 1.1050 1.1039 1.1032 1.0897 1.1047 1.0946 1.1053 1.1009
irintensity: 0.7011 0.4491 0.4151 1.9221 0.2607 0.2540 0.4816 0.5839 0.1673 1.2365 1.9605 1.2180 4.3499 0.6144 0.5884 0.1451 0.0263 1.0776 0.4280 0.0656 0.1358 0.0438 0.1718 0.1721 0.0444 0.0523 0.0709 0.4263 0.9403 0.1910 1.5090 0.5259 3.4914 4.1739 3.5907 19.4184 2.8476 0.7895 27.0839 5.4333 0.8849 36.0720 77.1565 89.3706 2.4427 21.9197 0.8487 7.9959 7.0770 0.3782 5.8486 0.3283 9.3131 2.6977 5.9289 12.8130 3.5963 34.0018 3.0370 8.0249 1.1422 4.7062 2.7684 23.5801 6.4888 20.0867 0.4966 6.3048 5.6717 24.5341 3.7331 1.3204 4.5731 13.8067 2.6525 2.9673 0.1137 10.2922 8.9838 0.6364 1.6643 0.1058 2.0465 0.4987 0.1310 0.7776 5.0459 0.5547 0.3528 5.0021 9.5535 8.1667 3.0239 6.7322 5.0746 7.2439 6.2914 8.9010 17.8024 5.4817 1.5129 8.4209 2.1998 1.0660 1.8644 0.6988 3.1389 3.7547 4.2776 0.2448 3.7005 31.9230 16.4921 25.7277 10.4412 9.8147 5.8395 8.5231 13.4657 6.8124 38.0267 0.3644 14.9065 8.9522 10.6538 29.0069 19.7329 47.2840 18.9001 8.4102 18.1709 106.3573 7.6078 3.5466 2.9966 13.5779 10.6397 11.3404 7.7502 7.4792 17.3406 34.5717 6.7721 22.7120 0.5197 2.8162 1.9203 6.9601 12.7054 1.5977 13.8975 26.0675 19.3867 11.4537 2.2094 46.3555 11.2386 6.7224 8.3806 5.2029 16.2503 0.1665 4.8453 2.0528 2.5530 6.4238 0.6534 0.1965 5.2567 0.4558 2.3997
temp: 298.150 k
press: 1.00000 atm
elementType: 7 7 6 6 6 6 6 6 6 6 6 6 6 6 6 6 6 6 6 6 6 6 6 1 1 1 1 1 1 1 1 1 1 1 1 1 1 1 1 1 1 1 1 1 1 1 1 1 1 1 1 1 1 1 1 1 1 1 1
symmnumber: 1
zpe: 1413273.1 jmol-1
zpe.correction: 0.538287 hartree
zpe.thermalcorrener: 0.561243 hartree
zpe.thermalcorrenthalpy: 0.562187 hartree
zpe.thermalcorrgfe: 0.487438 hartree
zpe.sumelectzpe: -928.936193 hartree
zpe.sumelectthermal: -928.913238 hartree
zpe.sumelectthermalent: -928.912294 hartree
zpe.sumelectthermalfe: -928.987043 hartree
dipole: -1.5768 -8.8277 -2.1355
dipole: 9.2182
quadrupole: -68.6536 -86.4111 -113.4143
quadrupole: 12.9122 0.7728 0.8685
quadrupole: 20.8394 3.0819 -23.9213 12.9122 0.7728 0.8685
hfenergy: -929.4744804 hartree
pointgroup: C01 [X(C21H36N2)]
dipole: -0.9491891 -3.4784613 0.3903374 debye
polarizability: 211.4673803|-17.1137335|251.5057505|15.2516503|5.820567|202.7803993 unknown
InChI: InChI=1S/C21H36N2/c1-19(18-20-10-6-4-7-11-20)22(2)14-16-23(3,17-15-22)21-12-8-5-9-13-21/h4,6-7,10-11,19,21H,5,8-9,12-18H2,1-3H3
charge 2 multiplicity 1
59 atoms
N  -1.828937 -0.69807 0.309614
N  0.702204 -2.484139 0.27835
C  -2.439847 0.644657 -0.364961
C  -0.505085 -0.326956 1.000196
C  -1.504071 -1.698387 -0.810672
C  0.336751 -1.531056 1.431192
C  -0.636517 -2.885799 -0.37054
C  1.700353 -1.823144 -0.792267
C  -3.687835 0.358939 -1.225452
C  -2.71856 1.746679 0.67804
C  -2.821884 -1.293296 1.302304
C  1.334491 -3.7438 0.881431
C  -4.10147 1.667803 -1.965359
C  -3.135757 3.053233 -0.062704
C  -4.358411 2.823493 -0.975596
C  2.918299 -1.111263 -0.128454
C  2.156856 -2.866244 -1.830593
C  2.705277 0.345259 0.285651
C  2.291361 1.307059 -0.675668
C  2.9779 0.775848 1.608779
C  2.135183 2.6652 -0.314479
C  2.822641 2.134445 1.972647
C  2.393169 3.080967 1.014041
H  -1.607877 0.970899 -1.024278
H  -0.738499 0.257368 1.903763
H  0.058046 0.330486 0.315974
H  -1.03772 -1.123056 -1.627208
H  -2.452812 -2.105921 -1.193456
H  1.26607 -1.14756 1.877968
H  -0.177564 -2.144527 2.191038
H  -1.161039 -3.522378 0.362582
H  -0.428033 -3.510286 -1.253133
H  1.079427 -1.057251 -1.289409
H  -4.536412 0.040181 -0.590459
H  -3.51008 -0.424789 -1.984105
H  -1.834481 1.968537 1.302656
H  -3.550926 1.449751 1.34441
H  -2.419393 -2.214862 1.747576
H  -3.012783 -0.56059 2.098383
H  -3.761138 -1.52258 0.779674
H  1.457574 -4.505067 0.099244
H  2.313632 -3.492468 1.312646
H  0.675372 -4.133957 1.672721
H  -5.005776 1.457778 -2.562945
H  -3.305953 1.953906 -2.682115
H  -2.280895 3.428111 -0.660745
H  -3.355209 3.826098 0.694695
H  -4.587336 3.748293 -1.533585
H  -5.251013 2.598677 -0.359201
H  3.717755 -1.142478 -0.894163
H  3.319261 -1.706356 0.71372
H  2.929175 -3.546285 -1.434284
H  2.620776 -2.318136 -2.669285
H  1.344548 -3.468752 -2.271522
H  2.154335 1.01624 -1.726524
H  3.36233 0.063044 2.351317
H  1.852783 3.403285 -1.072613
H  3.062172 2.456905 2.991038
H  2.296372 4.136009 1.288822
