program: Gaussian 09
title: 000216665
version: EM64L-G09RevD.01
frameworkgroup: C1[X(C21H23ClN2S)]
method: RPBEPBE
basis: SDD
operation: Freq
keyword: #p
keyword: freq=noraman
keyword: PBEPBE/SDD
title: #p freq=noraman PBEPBE/SDD
converged: YES YES NO NO
title: Mulliken charges:
elementType: Cl S N N C C C C C C C C C C C C C C C C C C C C C H H H H H H H H H H H H H H H H H H H H H H H
charge: -0.063981 0.148581 -0.145933 -0.047370 -0.117247 -0.125034 -0.442598 -0.442550 -0.439916 -0.428973 -0.209153 -0.613271 0.652169 -0.609609 0.636125 -0.375995 -0.431699 -0.309484 -0.433952 -0.252833 -0.114898 -0.243336 -0.284541 -0.248434 -0.243677 0.246640 0.244611 0.203710 0.227373 0.229486 0.200429 0.226324 0.179652 0.190027 0.226352 0.201576 0.221246 0.248387 0.184143 0.221792 0.223582 0.262139 0.228951 0.256151 0.259506 0.244787 0.229674 0.231075
chargesum: 0.00000
title: Mulliken charges with hydrogens summed into heavy atoms:
elementType: Cl S N N C C C C C C C C C C C C C C C C C C C C C
charge: -0.063981 0.148581 -0.145933 -0.047370 0.129393 0.119576 -0.011515 -0.012635 -0.033941 -0.012593 -0.007577 -0.143638 0.652169 0.019908 0.636125 -0.375995 -0.169560 -0.309484 -0.205001 0.003317 -0.114898 0.016170 -0.039754 -0.018760 -0.012603
polarizability: 3.59438010e+02 -1.15285586e+01 2.30723205e+02 -4.16438762e+00 -3.19674293e+01 1.99833646e+02
1716.lowfreq: -10.4612 -8.8718 -0.0019 -0.0018 0.0001 4.5987 19.6200 24.0475 37.3328
frequency: 18.9714 22.9154 37.3207 59.8316 74.5708 85.1681 110.5407 142.9499 143.8296 164.4996 174.9911 200.4040 216.2830 223.9063 234.2093 259.2709 277.5790 300.4442 310.0857 334.1516 345.0677 358.2571 374.4087 385.9747 432.1306 441.6410 447.7291 473.6242 490.9844 498.2762 505.9651 521.5193 575.7432 587.5597 614.1312 642.9666 652.2415 683.6165 707.6230 732.6250 742.8314 749.2413 756.5647 764.0623 791.2533 818.1920 823.5015 833.8091 842.0613 849.3223 869.5341 889.9815 911.0228 924.1558 938.3307 950.9865 957.7515 970.6010 979.7106 981.4164 995.5910 1025.8740 1026.4262 1031.4418 1041.0436 1060.6385 1067.7222 1080.7116 1090.5144 1103.8856 1113.1578 1122.4178 1127.3438 1137.7968 1150.1628 1171.0751 1174.2488 1178.2937 1183.1563 1198.1549 1207.3326 1219.0347 1233.1448 1238.1552 1251.1568 1251.7803 1259.9485 1270.7871 1290.9062 1297.4793 1307.5041 1312.8560 1328.5992 1336.1968 1339.9057 1358.8882 1364.4268 1367.8803 1379.8344 1400.7863 1419.9612 1430.3175 1445.2598 1453.5904 1459.2088 1459.9123 1465.8957 1467.8397 1477.2336 1480.2842 1483.3114 1567.8206 1579.4372 1586.1353 1599.9158 2807.9254 2818.1115 2832.8928 2849.5823 2981.5715 3004.8945 3008.8966 3011.3702 3014.9979 3027.0763 3029.8693 3046.4435 3054.5708 3070.6154 3074.6423 3098.2350 3112.3217 3125.4839 3142.7165 3142.7725 3144.6504 3164.4522 3174.8696
redmass: 5.7743 4.7859 4.9733 4.6553 4.3995 5.9630 4.6150 1.8022 6.6676 3.5845 3.3794 3.7036 1.3234 4.6593 3.8138 4.9664 3.4634 3.5758 4.2594 2.2804 4.2988 2.5350 5.4870 3.1687 3.2369 5.1024 3.4880 3.2377 4.1870 4.8271 4.3266 4.1490 6.1635 3.6295 5.4763 3.8704 5.8130 5.5465 3.7671 4.1399 3.6889 2.3913 1.8406 4.8886 1.5155 1.3672 4.0605 2.5879 2.5281 2.4182 1.8660 1.5167 2.7881 1.7160 1.5550 1.3502 1.9987 2.5712 1.3579 1.8310 3.1398 3.9233 2.7242 3.7310 2.9968 2.3494 1.5976 1.8028 2.0113 2.2375 1.3186 1.8181 1.6628 2.4691 2.6277 1.2283 1.1517 1.2861 1.3983 1.7429 1.8327 1.7982 1.4519 1.4273 1.3554 1.5069 1.5743 1.4248 1.4447 1.3793 1.5306 1.6380 1.6276 1.3801 1.6085 1.7392 1.4709 4.8780 4.2359 2.3699 1.9897 1.1706 1.0865 1.7826 1.1859 1.2742 1.0996 1.0969 1.9241 1.0630 1.0959 6.8005 6.4900 7.5348 6.3038 1.0722 1.0757 1.0703 1.0614 1.0608 1.0854 1.0872 1.0719 1.0593 1.0654 1.0981 1.0849 1.0874 1.1010 1.1043 1.1059 1.0877 1.0877 1.0927 1.0900 1.0913 1.1008 1.0964
irintensity: 0.0642 0.2391 0.0880 0.0570 0.2502 0.5439 0.3031 0.1273 0.3281 5.3961 0.2506 1.2184 0.3037 0.0773 0.4295 0.5455 2.7576 3.9505 1.9284 0.7316 0.7090 3.6818 1.7476 1.1807 6.3985 2.1326 0.5644 5.8759 4.9495 4.3974 6.1394 6.9039 10.5227 3.5067 1.3558 7.4677 11.4047 2.1984 5.3147 1.8872 33.4222 37.3175 27.3560 6.6339 5.6909 38.3877 23.7511 2.7656 14.3081 9.0851 2.6674 19.5084 0.5336 0.1621 2.3401 0.0830 8.2240 4.3285 1.6234 10.7745 18.2435 72.4963 47.5428 5.5294 16.5703 1.7484 0.5245 5.0282 30.3500 14.2859 4.9417 4.8249 4.5436 37.3616 44.4073 2.5006 3.2996 9.9073 3.9179 3.8495 3.3665 5.1147 13.2894 0.7745 18.1065 17.3753 14.6262 0.5396 3.5381 11.5980 2.7994 2.2907 21.4533 0.1890 0.5645 2.2911 1.0956 6.0750 1.6241 13.3514 14.6707 0.5183 4.0207 96.1450 28.5123 23.6099 20.5994 2.5260 47.8784 8.5692 10.9833 4.0663 25.2909 2.3870 6.4746 58.6226 57.5031 56.7178 246.3882 23.9858 31.5436 19.4418 71.9333 22.5042 54.0810 12.5731 75.8837 8.2064 28.5143 0.2452 54.4369 10.3553 1.8719 19.5922 3.2290 0.3511 34.7770 3.8305
temp: 298.150 k
press: 1.00000 atm
elementType: 17 16 7 7 6 6 6 6 6 6 6 6 6 6 6 6 6 6 6 6 6 6 6 6 6 1 1 1 1 1 1 1 1 1 1 1 1 1 1 1 1 1 1 1 1 1 1 1
symmnumber: 1
zpe: 1025317.4 jmol-1
zpe.correction: 0.390523 hartree
zpe.thermalcorrener: 0.412376 hartree
zpe.thermalcorrenthalpy: 0.413320 hartree
zpe.thermalcorrgfe: 0.338603 hartree
zpe.sumelectzpe: -1779.804576 hartree
zpe.sumelectthermal: -1779.782722 hartree
zpe.sumelectthermalent: -1779.781778 hartree
zpe.sumelectthermalfe: -1779.856495 hartree
dipole: 1.4177 1.0876 -1.1071
dipole: 2.1020
quadrupole: -163.3587 -157.9309 -158.5238
quadrupole: -1.6021 -6.0082 -8.1653
quadrupole: -3.4210 2.0069 1.4140 -1.6021 -6.0082 -8.1653
hfenergy: -1780.1950987 hartree
pointgroup: C01 [X(C21H23Cl1N2S1)]
dipole: 0.0840821 0.6971323 0.4368739 debye
polarizability: 255.1208405|-58.4739353|326.8305708|35.9328184|7.0363222|208.0434486 unknown
InChI: InChI=1S/C21H23ClN2S/c1-23-12-16-7-8-17(13-23)24(16)19-10-14-4-2-3-5-20(14)25-21-9-6-15(22)11-18(19)21/h2-6,9,11,16-17,19H,7-8,10,12-13H2,1H3
charge 0 multiplicity 1
48 atoms
Cl 1.531044 -5.44243 1.06903
S  -1.995926 -0.71457 -1.545589
N  0.73919 0.645934 -0.160888
N  3.544905 1.402482 0.4090
C  1.138884 2.034262 0.237293
C  1.878389 0.247759 -1.047815
C  1.442396 2.666013 -1.150305
C  1.932566 1.459274 -2.019851
C  2.406586 2.013808 1.136525
C  3.200668 0.113703 -0.24123
C  0.288165 -0.286294 0.891183
C  -0.973433 0.274709 1.629385
C  0.015912 -1.678372 0.324113
C  4.771361 1.328335 1.21744
C  -1.974694 1.071053 0.802473
C  -0.982165 -1.948567 -0.64929
C  0.762788 -2.766591 0.841905
C  -2.460329 0.716852 -0.483894
C  -2.49309 2.2610 1.386965
C  -1.199689 -3.277816 -1.096047
C  0.537638 -4.074529 0.380784
C  -0.436607 -4.352442 -0.594627
C  -3.41919 1.533158 -1.142555
C  -3.448702 3.073022 0.744775
C  -3.913904 2.703917 -0.537631
H  0.314853 2.546158 0.762673
H  1.657337 -0.704047 -1.559595
H  2.211083 3.453132 -1.070949
H  0.521213 3.107636 -1.567176
H  1.253779 1.283891 -2.871479
H  2.95402 1.618887 -2.404162
H  2.681819 3.049908 1.414113
H  2.180349 1.47044 2.093789
H  3.101552 -0.719932 0.504071
H  4.026028 -0.165158 -0.924648
H  1.054694 -0.434704 1.693464
H  -0.627754 0.930639 2.450557
H  -1.476038 -0.583641 2.117165
H  4.678272 0.647533 2.103175
H  5.036347 2.334981 1.589366
H  5.608052 0.961686 0.595228
H  1.524034 -2.577963 1.606008
H  -2.127042 2.545976 2.381684
H  -1.983168 -3.476473 -1.835011
H  -0.611227 -5.374003 -0.943245
H  -3.782029 1.241903 -2.135323
H  -3.822602 3.97837 1.234358
H  -4.654734 3.315913 -1.063213
