program: Gaussian 09
title: 000211422
version: EM64L-G09RevD.01
frameworkgroup: C1[X(C17H17N3)]
method: RPBEPBE
basis: SDD
operation: Freq
keyword: #pfreq=noraman
keyword: PBEPBE/SDD
title: #p freq=noraman PBEPBE/SDD
converged: YES YES NO NO
title: Mulliken charges:
elementType: N N N C C C C C C C C C C C C C C C C C H H H H H H H H H H H H H H H H H
charge: -0.403947 -0.137956 -0.102879 0.206966 0.223548 0.079810 -0.084227 -0.285620 -0.411369 0.357924 -0.358473 -0.374664 -0.256387 -0.249416 -0.674910 -0.414279 -0.378515 -0.238236 -0.231776 -0.243221 0.222324 0.245431 0.303463 0.215517 0.192426 0.201500 0.275280 0.232509 0.234088 0.214598 0.218451 0.219896 0.258554 0.265225 0.225042 0.225915 0.227406
chargesum: 0.00000
title: Mulliken charges with hydrogens summed into heavy atoms:
elementType: N N N C C C C C C C C C C C C C C C C C
charge: -0.100484 -0.137956 -0.102879 0.206966 0.223548 0.079810 -0.084227 0.182135 -0.003426 0.357924 -0.156973 -0.099384 -0.023878 -0.015328 -0.021964 -0.155725 -0.113291 -0.013194 -0.005861 -0.015815
polarizability: 3.29123062e+02 -1.26735704e+01 2.26913216e+02 6.68553584e+00 1.45784250e+01 1.12511823e+02
1716.lowfreq: -6.7579 -0.0006 -0.0001 0.0007 2.4688 8.4190 23.6515 47.1645 51.5271
frequency: 23.5268 47.1087 51.5126 60.5555 69.3040 89.2963 104.5474 144.3737 177.1998 219.6815 223.2070 230.9197 238.5009 266.3043 327.4206 345.5499 385.1225 406.8312 419.6297 430.4169 452.7124 481.7976 499.5757 535.9866 588.1912 613.6820 627.4475 639.5821 660.9732 690.1779 703.8388 747.1655 759.4218 761.3551 774.8155 788.7061 790.8911 852.6589 870.3493 881.5187 904.8260 923.8873 950.6170 956.7669 977.2462 988.2383 993.3504 999.3377 1002.9882 1027.6521 1040.4155 1053.3720 1077.3825 1084.7360 1110.1307 1130.8614 1148.0060 1161.1856 1171.5627 1179.8256 1189.1891 1207.1491 1232.3296 1254.6467 1263.7889 1282.2722 1297.1997 1317.8831 1343.5644 1356.0042 1370.8843 1377.7790 1394.1862 1400.1157 1415.7964 1433.4115 1465.3224 1473.3296 1478.5807 1478.8552 1483.1928 1490.4443 1498.4887 1539.6376 1565.4315 1582.7363 1610.0451 1616.3197 2961.6607 2971.4873 2981.5384 3016.9645 3051.2197 3078.2731 3083.1943 3120.3137 3121.1542 3130.4540 3137.2965 3143.2168 3156.1842 3157.2577 3169.2206 3172.2309 3582.0000
redmass: 2.8562 2.6319 4.2992 3.0907 3.1081 3.8713 4.3561 3.1012 4.1791 1.1434 3.7215 4.9368 3.9252 4.3511 2.8949 1.7239 5.4524 2.8258 4.5429 2.9120 4.5788 4.6242 5.7622 5.6127 5.8165 6.0712 6.6301 3.5538 4.9786 6.1951 1.7787 1.1035 2.0847 3.8061 1.8784 5.6958 3.4838 1.2900 1.4960 1.1708 1.7157 1.4602 5.9703 1.3866 1.3770 5.2250 1.3587 1.6317 3.5260 2.2627 2.7321 2.5737 2.3696 1.9289 2.4258 2.5217 1.6353 2.4603 1.0536 1.1753 1.1182 2.9854 1.4156 2.4042 1.7686 1.1130 1.3944 1.4818 2.4307 1.9191 2.2415 5.7568 1.2860 4.5653 2.0372 2.3073 2.8908 1.0654 2.6550 1.0676 1.0741 2.8787 1.0777 3.3440 7.0997 6.1310 6.0964 5.9525 1.0613 1.0684 1.0361 1.0947 1.0982 1.1008 1.0996 1.0865 1.0846 1.0881 1.0891 1.0937 1.0959 1.0963 1.0989 1.0982 1.0766
irintensity: 0.5434 5.4957 1.9830 0.9086 0.2090 4.1173 2.1532 0.4838 1.2386 0.3714 1.8488 0.0108 0.2379 0.3848 13.4627 56.4626 0.6159 0.9420 2.6549 10.6600 1.5046 2.3373 3.4082 1.7762 12.0237 3.7359 6.9818 62.1654 1.1078 3.3825 51.8086 4.3520 24.5806 16.2045 73.2074 3.4725 10.1256 1.0780 0.9000 3.6310 9.3825 2.9434 2.2543 0.2586 2.0881 0.2025 0.2925 0.9290 2.0587 12.6261 8.5385 1.1784 14.8150 3.0635 10.7351 68.0386 28.3162 5.6453 0.0093 5.2603 1.8582 31.3372 18.8049 9.0102 2.8211 0.2075 29.5749 7.9403 37.7434 20.1758 18.6327 1.1786 32.3077 54.6281 13.9052 12.9148 142.7317 4.2365 25.0478 15.4710 3.7775 20.3044 24.9668 369.9055 41.5620 2.9146 2.0827 14.0647 30.9163 39.4690 42.0874 15.3423 15.2303 65.8424 46.2750 7.7927 2.9072 4.5581 13.6579 39.6174 14.2757 33.7389 15.8600 16.6096 51.2533
temp: 298.150 k
press: 1.00000 atm
elementType: 7 7 7 6 6 6 6 6 6 6 6 6 6 6 6 6 6 6 6 6 1 1 1 1 1 1 1 1 1 1 1 1 1 1 1 1 1
symmnumber: 1
zpe: 785447.1 jmol-1
zpe.correction: 0.299161 hartree
zpe.thermalcorrener: 0.316856 hartree
zpe.thermalcorrenthalpy: 0.317800 hartree
zpe.thermalcorrgfe: 0.251969 hartree
zpe.sumelectzpe: -820.838161 hartree
zpe.sumelectthermal: -820.820466 hartree
zpe.sumelectthermalent: -820.819522 hartree
zpe.sumelectthermalfe: -820.885353 hartree
dipole: -2.3454 4.4580 0.1946
dipole: 5.0411
quadrupole: -90.7100 -111.6966 -120.0116
quadrupole: -2.5096 0.4845 2.3777
quadrupole: 16.7627 -4.2238 -12.5388 -2.5096 0.4845 2.3777
hfenergy: -821.137322 hartree
pointgroup: C01 [X(C17H17N3)]
dipole: 0.9780655 -1.6907571 0.3438912 debye
polarizability: 329.6492868|-10.8892018|218.5541855|-6.9932894|-32.0454727|120.3446289 unknown
InChI: InChI=1S/C17H17N3/c1-2-12-18-17-15-11-7-6-10-14(15)16(19-20-17)13-8-4-3-5-9-13/h3-11,18H,2,12H2,1H3
charge 0 multiplicity 1
37 atoms
N  3.214693 0.019839 -0.075364
N  1.26356 1.232003 -0.453965
N  -0.113322 1.359316 -0.428167
C  1.055699 -1.182289 0.07932
C  -0.378436 -1.040323 0.041075
C  1.839239 0.027496 -0.141984
C  -0.918387 0.296818 -0.155441
C  4.034618 1.216711 -0.338624
C  5.486544 0.991319 0.124918
C  -2.371552 0.624038 -0.089908
C  1.63067 -2.474973 0.267394
C  -1.183938 -2.220575 0.131436
C  0.818105 -3.608395 0.393294
C  -0.598471 -3.479226 0.308261
C  6.378955 2.212091 -0.183816
C  -3.222379 0.0864 0.915222
C  -2.917334 1.55519 -1.015131
C  -4.585215 0.451864 0.976432
C  -4.279244 1.916328 -0.955421
C  -5.122357 1.361741 0.036884
H  4.008009 1.466563 -1.419351
H  3.577022 2.075238 0.18515
H  3.702865 -0.856604 0.101144
H  5.496057 0.784441 1.213373
H  5.904815 0.094538 -0.379341
H  2.718821 -2.604727 0.302368
H  -2.269422 -2.132116 0.036089
H  1.269933 -4.595773 0.53691
H  -1.230063 -4.371959 0.371558
H  6.405014 2.420511 -1.269504
H  5.999417 3.118063 0.323593
H  7.416757 2.044019 0.15476
H  -2.810225 -0.584351 1.677393
H  -2.252042 1.993506 -1.765215
H  -5.223134 0.035991 1.764665
H  -4.68369 2.631492 -1.68065
H  -6.180585 1.642594 0.083442
