program: Gaussian 09
title: 000211419
version: EM64L-G09RevD.01
frameworkgroup: C1[X(C16H15N3O7S)]
method: RPBEPBE
basis: SDD
operation: Freq
keyword: #p
keyword: freq=noraman
keyword: PBEPBE/SDD
title: #p freq=noraman PBEPBE/SDD
converged: YES YES NO NO
title: Mulliken charges:
elementType: S O O O O O O O N N N C C C C C C C C C C C C C C C C H H H H H H H H H H H H H H H
charge: 0.950575 -0.519108 -0.507279 -0.246017 -0.410318 -0.241300 -0.195806 -0.195193 -0.492285 -0.455672 0.026894 -0.126394 0.314462 0.497630 -0.343212 -0.309820 -0.221287 -0.172997 -0.431260 -0.340396 -0.565222 -0.331509 -0.337290 0.228728 0.391968 -0.469220 0.193791 0.278053 0.231968 0.287905 0.297477 0.297019 0.228742 0.316667 0.284831 0.232318 0.313679 0.298981 0.298855 0.298991 0.261064 0.380989
chargesum: 0.00000
title: Mulliken charges with hydrogens summed into heavy atoms:
elementType: S O O O O O O O N N N C C C C C C C C C C C C C C C C
charge: 0.950575 -0.519108 -0.507279 -0.246017 -0.029330 -0.241300 -0.195806 -0.195193 -0.214232 -0.141993 0.026894 -0.126394 0.314462 0.497630 -0.111244 -0.021915 0.076189 0.124022 -0.202518 -0.023729 -0.048073 -0.032528 -0.038435 0.228728 0.391968 0.090835 0.193791
polarizability: 4.33955292e+02 -8.17698770e+00 2.71028336e+02 1.49954655e+01 1.38048890e+01 1.81676570e+02
1716.lowfreq: -4.2704 -2.4439 -0.0019 -0.0008 0.0011 3.4946 6.1776 14.5777 15.7778
frequency: 5.8611 14.4551 15.6479 25.9232 35.2593 41.6631 46.0043 62.3993 67.6864 75.9757 88.0772 102.3149 109.4767 117.8346 143.2606 158.7600 190.6897 199.7018 217.7894 225.0033 236.1826 262.4293 302.6483 324.8339 344.5489 364.1466 385.5802 402.7908 410.4290 411.9352 428.0987 448.2725 472.0570 496.8148 501.9171 505.2440 519.0717 555.0567 568.6710 599.0146 611.6425 627.6541 647.1721 660.9195 661.0709 675.2190 700.9104 730.1212 733.5404 776.8170 781.6058 800.3391 812.0022 818.6194 834.5096 843.1340 852.4717 865.8419 870.9560 883.3133 941.0492 942.2218 955.7359 989.8116 991.7742 999.5469 999.6880 1000.0535 1016.1711 1036.9407 1051.2925 1085.3318 1096.7142 1102.5688 1120.7745 1150.9962 1168.5471 1178.7436 1184.1968 1208.4818 1214.9129 1239.3926 1242.1330 1260.2928 1273.6864 1279.6378 1310.4640 1332.3396 1368.6225 1374.9186 1384.4002 1391.6531 1419.5165 1429.2861 1441.9597 1447.7358 1451.6320 1485.7490 1505.6176 1574.3450 1577.3639 1601.8390 1610.4692 1630.4787 1662.3503 2983.6826 3000.6175 3038.0088 3074.7939 3114.2441 3139.1352 3156.6198 3163.9422 3172.9346 3186.3842 3188.7029 3200.8590 3358.1723 3514.9379 3517.9842
redmass: 9.4426 6.4040 6.5375 7.1109 6.9115 7.8042 6.8927 4.7364 6.0939 4.1647 5.7028 4.6723 6.9735 5.7887 10.3609 7.1223 6.9503 10.0201 8.8055 6.5033 7.8140 7.6900 5.4434 7.3475 6.8073 10.8854 7.5092 5.5892 2.8859 3.4088 3.1597 4.5316 6.8517 4.6123 2.9819 7.1092 2.2240 2.7875 4.2948 3.5067 7.0916 6.4645 1.4342 2.9803 1.4277 8.4868 5.1278 3.8945 3.9815 2.9913 8.2936 2.6912 3.2031 1.5852 1.8071 4.0077 1.2714 1.5273 1.5204 4.5025 1.5797 3.5614 9.9337 2.4120 2.0108 1.8108 1.6402 1.4968 2.1378 2.3456 3.0062 3.8369 2.4494 1.2814 1.3852 1.4636 1.2373 1.8182 1.2109 1.1934 8.1881 2.5863 1.3401 1.5154 2.0454 1.2461 1.4994 1.6041 6.3123 2.5721 2.5564 5.8320 7.0686 3.9218 1.0771 2.1507 1.1018 2.1658 2.7066 5.0946 6.0003 8.4136 5.6126 4.8904 8.0511 1.0605 1.0642 1.0989 1.0964 1.0875 1.0969 1.0907 1.0907 1.0915 1.0949 1.0963 1.0956 1.0756 1.0640 1.0764
irintensity: 0.0799 0.2702 1.0132 0.4072 4.1867 2.9006 0.0504 0.3639 0.1508 5.8206 3.8579 2.0272 2.2573 3.5325 23.5111 29.5365 7.9756 8.3622 1.4270 2.8866 0.5240 11.6338 4.9081 18.9606 4.4577 19.8686 14.2211 11.8923 0.1632 10.4636 13.2837 32.2347 33.2564 106.8788 17.8927 2.4788 22.2062 16.2033 62.8563 7.7751 0.0141 4.6918 132.3351 47.4717 24.9877 17.1236 6.1456 6.6845 0.9682 17.2652 38.9481 9.4214 98.5645 8.3018 172.7709 22.8888 1.6500 34.0122 29.6022 3.4265 0.1940 3.3465 49.4747 2.6649 16.6385 0.7506 1.7223 2.5383 70.9005 15.1422 237.0987 8.1608 83.1601 11.6991 14.4474 51.9106 20.9882 96.9406 63.1073 1.7839 311.5011 0.9516 60.2739 102.2142 16.6888 0.2534 38.6393 128.3154 56.2024 279.1267 22.2886 58.5274 42.7806 82.8366 8.9418 6.7308 53.8451 46.8241 567.9216 118.9402 34.1623 0.7618 163.4199 110.4655 182.0789 15.4506 40.7038 12.4133 7.1660 16.5965 9.9909 4.3226 3.4493 0.2988 2.8728 1.3709 5.9263 19.8423 31.8580 17.6399
temp: 298.150 k
press: 1.00000 atm
elementType: 16 8 8 8 8 8 8 8 7 7 7 6 6 6 6 6 6 6 6 6 6 6 6 6 6 6 6 1 1 1 1 1 1 1 1 1 1 1 1 1 1 1
symmnumber: 1
zpe: 778851.7 jmol-1
zpe.correction: 0.296649 hartree
zpe.thermalcorrener: 0.323085 hartree
zpe.thermalcorrenthalpy: 0.324029 hartree
zpe.thermalcorrgfe: 0.232868 hartree
zpe.sumelectzpe: -1705.397634 hartree
zpe.sumelectthermal: -1705.371198 hartree
zpe.sumelectthermalent: -1705.370254 hartree
zpe.sumelectthermalfe: -1705.461415 hartree
dipole: -4.3977 1.2923 5.6244
dipole: 7.2556
quadrupole: -159.5754 -211.0450 -157.6439
quadrupole: -0.5009 1.5824 -8.8192
quadrupole: 16.5127 -34.9569 18.4442 -0.5009 1.5824 -8.8192
hfenergy: -1705.6942829 hartree
pointgroup: C01 [X(C16H15N3O7S1)]
dipole: -1.7535762 -0.353362 -2.224549 debye
polarizability: 433.9753107|6.4082024|268.9252014|-16.1315918|18.9603781|183.7596864 unknown
InChI: InChI=1S/C16H15N3O7S/c20-15(9-10-16(21)22)17-11-1-3-12(4-2-11)18-27(25,26)14-7-5-13(6-8-14)19(23)24/h1-8,17-18,21H,9-10H2
charge 0 multiplicity 1
42 atoms
S  3.490199 2.212561 0.728595
O  4.911855 2.913985 0.367543
O  2.734382 2.379937 2.156016
O  -3.930945 1.084645 1.156191
O  -8.763117 -0.496931 0.679054
O  -7.323674 -2.242632 0.15988
O  5.158772 -4.207384 -0.923824
O  3.325319 -4.614847 0.371944
N  2.199865 2.917873 -0.643541
N  -2.90157 0.434131 -0.852029
N  4.177419 -3.820587 -0.181557
C  3.708081 0.340315 0.460493
C  0.953787 2.249409 -0.691178
C  -1.627355 1.050159 -0.748982
C  0.572769 1.404948 -1.777042
C  0.027228 2.462849 0.371581
C  4.777105 -0.08795 -0.346843
C  2.791613 -0.530659 1.076407
C  -0.709195 0.837329 -1.816996
C  -1.242832 1.864551 0.35589
C  -5.163087 -0.400258 -0.368944
C  4.937517 -1.47305 -0.554488
C  2.948848 -1.915835 0.862283
C  -3.962956 0.452988 0.060837
C  4.014139 -2.357638 0.046904
C  -6.456745 0.071156 0.315219
C  -7.505653 -1.019841 0.357092
H  2.756089 2.842165 -1.518082
H  1.277154 1.215758 -2.596557
H  0.321779 3.114483 1.199269
H  5.477632 0.640985 -0.767182
H  2.000799 -0.137063 1.722342
H  -0.998491 0.212992 -2.67185
H  -1.950508 2.029699 1.169574
H  -4.972527 -1.452173 -0.075181
H  -5.27796 -0.401472 -1.469662
H  -3.058959 -0.112031 -1.703314
H  5.75431 -1.874421 -1.159611
H  2.274088 -2.647557 1.313467
H  -6.221001 0.372473 1.355497
H  -6.883589 0.968003 -0.165917
H  -9.424484 -1.239066 0.739201
