program: Gaussian 09
title: 000211416
version: EM64L-G09RevD.01
frameworkgroup: C1[X(C12H5Br4O4P)]
method: RPBEPBE
basis: SDD
operation: Freq
keyword: #p
keyword: freq=noraman
keyword: PBEPBE/SDD
title: #p freq=noraman PBEPBE/SDD
converged: YES YES NO NO
title: Mulliken charges:
elementType: Br Br Br Br P O O O O C C C C C C C C C C C C H H H H H
charge: 0.065128 0.085687 0.046465 0.046505 1.352446 -0.485287 -0.493912 -0.622065 -0.522128 0.304660 0.308304 0.304301 0.289978 -0.298938 -0.300438 -0.380444 -0.388108 -0.252847 -0.251489 -0.169105 -0.166243 0.277784 0.277378 0.280188 0.280759 0.411421
chargesum: 0.00000
title: Mulliken charges with hydrogens summed into heavy atoms:
elementType: Br Br Br Br P O O O O C C C C C C C C C C C C
charge: 0.065128 0.085687 0.046465 0.046505 1.352446 -0.485287 -0.493912 -0.210644 -0.522128 0.304660 0.308304 0.304301 0.289978 -0.021154 -0.023060 -0.380444 -0.388108 -0.252847 -0.251489 0.111083 0.114516
polarizability: 3.13179850e+02 -4.90831280e-01 3.12067943e+02 -2.31323894e+00 2.75729116e+00 1.15408912e+02
1716.lowfreq: 0.0009 0.0010 0.0015 1.9471 2.2614 4.5158 23.5231 28.3504 46.4485
frequency: 23.5185 28.3434 46.4478 47.5193 78.6325 88.2591 116.0951 122.1173 131.6827 136.8659 169.4378 175.3978 197.0537 205.5837 219.4222 237.0074 245.2622 266.4844 292.8895 320.2017 329.9499 332.3152 334.0516 364.6329 407.2118 414.7161 479.9605 496.0364 521.6771 531.5329 566.2252 576.2545 598.3169 622.8105 648.5343 680.3764 707.9895 732.6427 742.7451 757.5304 798.3221 830.0850 857.0533 871.5848 874.0046 880.1941 899.9334 1021.6128 1029.8276 1083.3948 1090.7353 1096.4733 1151.4429 1186.8552 1205.0856 1206.6396 1275.9166 1347.3861 1349.2111 1367.1975 1381.5364 1419.3885 1436.5207 1531.5602 1547.6458 1576.4289 1580.4612 3169.6571 3172.6808 3185.5055 3185.6573 3586.8881
redmass: 58.6332 16.5049 24.9926 14.3445 12.7926 62.1937 15.0693 26.2225 9.3396 11.1449 5.7479 8.3480 25.3899 21.0659 4.8189 8.4808 8.7678 1.5900 10.6064 5.2015 5.5488 10.2497 10.0747 6.5181 10.4429 10.1809 5.1963 9.2801 7.4234 8.0827 4.8984 4.2516 6.1373 6.4639 9.4274 12.6128 12.6395 7.8066 8.4021 6.0059 9.1486 7.9005 8.6346 1.4426 1.4351 1.3662 1.4371 1.6979 4.4176 2.7123 4.5787 2.3061 3.8124 3.2777 1.6248 2.2355 1.8421 6.4049 5.6825 4.0269 4.0717 3.1046 5.4853 7.1761 8.6577 8.3532 7.8823 1.0928 1.0923 1.0936 1.0936 1.0663
irintensity: 0.0061 0.2389 0.0835 0.5838 0.6339 0.0907 0.3288 0.1016 0.3680 0.2702 1.0505 5.8887 2.1039 0.2156 0.0773 1.1352 12.1946 67.8568 0.8885 44.8592 47.0015 6.4337 20.0984 4.5946 6.0396 5.6778 8.0780 9.2055 6.5723 59.9934 2.0412 10.4951 0.5270 25.8619 98.6930 70.0205 34.2087 170.2656 162.4250 45.4025 4.0506 40.1090 2.8211 50.1030 4.3535 0.3524 0.3319 33.4834 148.7579 11.8689 192.6055 21.3225 23.0971 30.6212 2.5532 47.2195 0.0536 38.1031 7.3730 32.0661 118.9360 90.4177 25.1369 157.1139 32.0963 49.4210 10.8206 0.6489 0.0019 1.2516 0.9345 133.5317
temp: 298.150 k
press: 1.00000 atm
elementType: 35 35 35 35 15 8 8 8 8 6 6 6 6 6 6 6 6 6 6 6 6 1 1 1 1 1
symmnumber: 1
zpe: 371982.5 jmol-1
zpe.correction: 0.141681 hartree
zpe.thermalcorrener: 0.162403 hartree
zpe.thermalcorrenthalpy: 0.163347 hartree
zpe.thermalcorrgfe: 0.088322 hartree
zpe.sumelectzpe: -1154.742536 hartree
zpe.sumelectthermal: -1154.721815 hartree
zpe.sumelectthermalent: -1154.720870 hartree
zpe.sumelectthermalfe: -1154.795895 hartree
dipole: -1.3317 1.2274 1.0453
dipole: 2.0911
quadrupole: -156.3115 -159.9422 -173.3950
quadrupole: 8.6355 0.8464 -6.9117
quadrupole: 6.9047 3.2740 -10.1788 8.6355 0.8464 -6.9117
hfenergy: -1154.8842171 hartree
pointgroup: C01 [X(C12H5Br4O4P1)]
dipole: 0.53149 -0.4721618 0.4139986 debye
dipolederiv: -0.2162741 -0.2415982 0.124077 -0.2924796 -0.3629016 0.1914464 0.1304964 0.1464281 -0.0624807 -0.2064335 0.2564044 0.1095544 0.2885061 -0.3558142 -0.1664311 0.1217563 -0.1445472 -0.034577 -0.250072 0.266732 -0.0972316 0.3368036 -0.5028481 0.1900385 -0.1371768 0.2036048 -0.0828342 -0.2530847 -0.2719556 -0.0850618 -0.3462357 -0.5192815 -0.1689572 -0.1213561 -0.1808665 -0.064455 2.010967 0.1576795 0.1956431 0.0321627 2.402989 0.077049 -0.3195879 0.2553279 1.458654 -0.882643 0.4185725 -0.0520682 0.5309987 -1.0307341 0.0340985 -0.0227137 0.2892159 -0.3990059 -0.8606286 -0.3516426 -0.0279312 -0.5177275 -0.9963375 -0.0050077 0.0301173 -0.2199072 -0.3995185 -0.730531 -0.2863656 -0.2254539 -0.1050047 -0.8093294 -0.2622275 -0.112404 -0.5103171 -0.6804835 -0.5760079 0.0065777 -0.0671297 -0.0003505 -0.8197868 0.0403669 0.0280876 0.1019527 -0.5250874 0.2049243 -0.017686 0.0260876 0.0794093 0.0291567 -0.0858444 -0.0495991 -0.0217838 0.0251178 0.1979062 0.0183545 0.0170257 -0.0745728 0.0320242 0.0876131 -0.0476072 0.0214057 0.0225305 0.1917973 -0.3768013 0.12059 -0.5757981 0.4015268 -0.0270987 0.3389282 -0.233552 0.0620908 0.2241566 0.4314689 0.0917858 0.602876 0.4285856 0.0151609 0.3103206 0.2145199 0.0526486 -0.3201241 0.1871195 -0.0681161 0.1843514 -0.2842299 0.0668044 -0.1357756 0.081054 -0.0870113 -0.330271 -0.1868899 -0.0573217 -0.1898807 -0.2918973 -0.0560547 -0.1270401 -0.0703549 -0.083805 0.3940181 0.4191295 -0.2162245 0.6623083 0.59513 -0.3970004 -0.2800083 -0.3189092 0.0661316 0.3759479 -0.433274 -0.1812366 -0.6774577 0.6490088 0.3570329 -0.2419847 0.298115 0.0165264 0.4702579 -0.4890698 0.1740925 -0.6325176 0.9133226 -0.4174484 0.2958125 -0.4339112 0.0433019 0.4827927 0.4962245 0.1495399 0.6448454 0.9538344 0.3749075 0.2647889 0.3882167 0.0045887 -0.2301822 0.0375733 0.0045825 0.0064112 -0.5048375 0.2113975 -0.0037983 0.2048447 -0.1073484 -0.2216429 -0.0427592 -0.0005736 -0.0002687 -0.5344103 -0.1971977 0.0003536 -0.1860251 -0.0866821 0.0800654 -0.0640581 0.0298138 -0.0600874 0.0450382 0.0401137 0.0446464 0.0378309 0.1235874 0.0796224 0.0652743 0.0262824 0.0618464 0.0411136 -0.0364636 0.0422935 -0.0335587 0.1276427 0.0177232 0.0046711 0.0037368 0.0033055 0.1091585 0.0165008 -0.0029851 0.0202737 0.1500871 0.0188486 -0.0038307 0.0036723 -0.0018072 0.1069 -0.0148935 -0.0041297 -0.016733 0.1514219 0.3288676 0.0001492 0.0018651 0.0403637 0.3046197 0.1320947 -0.0014349 0.1076758 0.3089596 unknown
polarizability: 313.2137384|-0.5037536|311.9124401|0.3732432|-6.0547873|115.5305262 unknown
InChI: InChI=1S/C12H5Br4O4P/c13-5-1-7-8-2-6(14)4-10(16)12(8)20-21(17,18)19-11(7)9(15)3-5/h1-4,17H
charge 0 multiplicity 1
26 atoms
Br 3.932949 1.838833 -1.158266
Br -3.935622 1.916708 0.968611
Br 3.768024 -3.508924 1.06429
Br -3.795868 -3.543723 -0.965163
P  -0.010261 2.649624 -0.097355
O  0.858105 1.480602 -1.085501
O  -0.861578 1.526748 0.942499
O  1.067301 3.207891 1.108769
O  -0.753365 3.736614 -0.964404
C  0.736278 -0.734722 -0.018675
C  -0.752878 -0.732085 -0.020854
C  1.497336 0.373698 -0.491152
C  -1.510504 0.402143 0.391041
C  1.432658 -1.885146 0.4373
C  -1.453645 -1.901131 -0.419105
C  2.91255 0.322454 -0.496309
C  -2.926219 0.36017 0.398597
C  2.837451 -1.915563 0.418499
C  -2.858724 -1.923571 -0.400535
C  3.598577 -0.821746 -0.045407
C  -3.615314 -0.803683 0.004301
H  0.86944 -2.733932 0.833826
H  -0.894101 -2.771619 -0.771286
H  4.6902 -0.855019 -0.056628
H  -4.707133 -0.830912 0.013782
H  1.345242 4.152688 0.987925
