program: Gaussian 09
title: 000211414
version: EM64L-G09RevD.01
frameworkgroup: C1[X(C10H11NS)]
method: RPBEPBE
basis: SDD
operation: Freq
keyword: #p
keyword: freq=noraman
keyword: PBEPBE/SDD
title: #p freq=noraman PBEPBE/SDD
converged: YES YES NO NO
title: Mulliken charges:
elementType: S N C C C C C C C C C C H H H H H H H H H H H
charge: 0.146744 -0.012924 -0.427383 -0.442069 -0.345505 -0.636599 0.487999 -0.369377 -0.356992 -0.221084 -0.230567 -0.231819 0.268412 0.241018 0.232666 0.234443 0.242149 0.214133 0.275263 0.241488 0.229875 0.229202 0.230926
chargesum: 0.00000
title: Mulliken charges with hydrogens summed into heavy atoms:
elementType: S N C C C C C C C C C C
charge: 0.146744 -0.012924 -0.158971 0.031615 -0.345505 0.054126 0.487999 -0.094114 -0.115504 0.008791 -0.001365 -0.000894
polarizability: 1.96323584e+02 -6.59335751e+00 1.29926324e+02 4.96108396e+00 1.95496551e+00 6.83534518e+01
1716.lowfreq: -7.9315 0.0016 0.0020 0.0027 4.7491 10.3811 39.4890 59.0426 121.4246
frequency: 39.4856 59.0382 121.4218 137.2609 234.1092 246.7900 272.0185 318.9338 340.7282 388.5683 401.0763 446.8127 543.7961 581.0743 604.5601 617.2294 651.1432 695.1594 706.9422 780.0061 845.5095 856.0365 891.8349 925.2158 939.4522 957.9220 986.4209 989.4916 1003.8973 1009.2435 1027.6563 1077.2800 1088.2031 1100.5299 1173.1056 1185.7285 1188.4592 1217.2858 1245.0284 1299.6276 1312.5963 1318.1166 1384.4810 1390.3519 1435.9626 1447.9891 1463.3683 1470.4382 1479.5901 1582.3337 1603.4949 1612.6029 2976.0955 2979.1045 3047.5216 3060.5855 3074.7941 3099.0945 3126.7354 3134.4843 3146.4836 3159.9997 3170.3735
redmass: 4.0092 3.7684 3.7811 4.8923 1.3733 1.9841 5.6635 2.7359 3.6507 4.1038 2.8126 3.9590 6.8293 6.8219 4.8024 6.2658 6.2341 1.8075 3.9351 1.8280 2.9609 1.2510 3.7569 1.9230 1.4387 4.0278 1.3940 5.9224 1.3311 1.4953 2.0705 1.6070 1.6170 1.9719 1.0593 1.4568 1.1143 1.2741 2.8240 1.4381 1.3104 1.3193 8.4536 1.2075 2.2397 1.1088 1.0479 1.0499 2.2775 6.2732 8.3514 6.2222 1.0407 1.0603 1.0983 1.0907 1.0945 1.0999 1.0850 1.0885 1.0931 1.0965 1.1002
irintensity: 0.0435 1.3464 2.6557 1.4603 0.9221 2.5850 2.1875 2.0701 7.8393 1.7550 0.0101 0.4657 5.4087 21.0719 15.9458 0.9064 22.8704 50.0363 1.3900 53.6533 0.8315 0.1112 82.2827 51.7780 4.7932 16.8038 0.2914 0.0577 0.7187 9.6367 5.6110 2.9960 7.4435 2.5103 0.3590 1.0826 10.1223 18.8356 55.4933 1.2444 29.0547 4.7110 0.7954 20.1023 18.4471 1.2936 14.4213 8.7074 14.0909 24.2887 47.1983 9.1679 27.4472 42.4102 20.7472 5.7335 36.0715 25.2905 1.2594 6.5471 22.8380 18.2153 19.8480
temp: 298.150 k
press: 1.00000 atm
elementType: 16 7 6 6 6 6 6 6 6 6 6 6 1 1 1 1 1 1 1 1 1 1 1
symmnumber: 1
zpe: 482517.8 jmol-1
zpe.correction: 0.183781 hartree
zpe.thermalcorrener: 0.194639 hartree
zpe.thermalcorrenthalpy: 0.195583 hartree
zpe.thermalcorrgfe: 0.146303 hartree
zpe.sumelectzpe: -839.605321 hartree
zpe.sumelectthermal: -839.594464 hartree
zpe.sumelectthermalent: -839.593520 hartree
zpe.sumelectthermalfe: -839.642800 hartree
dipole: -0.7127 0.0163 0.2944
dipole: 0.7713
quadrupole: -60.2029 -77.4212 -82.1604
quadrupole: -2.4991 0.9909 -0.8682
quadrupole: 13.0586 -4.1597 -8.8989 -2.4991 0.9909 -0.8682
hfenergy: -839.7891027 hartree
pointgroup: C01 [X(C10H11N1S1)]
dipole: -0.2793057 -0.0083851 -0.1183 debye
dipolederiv: -0.5740713 0.2389864 -0.0781449 0.2313509 -0.5051263 -0.0068153 -0.0164521 -0.0281813 -0.1393072 -0.6390518 -0.0497464 0.0155172 0.004412 -0.8955484 0.0703203 -0.0697088 -0.0247008 -0.2706615 0.4260676 -0.0121124 0.1246422 0.196283 -0.0502647 0.0935779 0.1339295 0.0652708 0.2200825 0.2272043 0.0719822 -0.0318171 -0.0098437 0.2443639 -0.0050397 0.0431365 -0.0065085 0.203476 1.1362007 -0.2310581 -0.0634352 -0.5920021 0.9960304 -0.0489132 -0.0920369 0.0198186 -0.002404 -0.0621899 0.0291536 -0.0858488 -0.0388551 0.0553746 -0.0177351 -0.0296029 0.0125002 -0.1064597 -0.2512138 0.0221461 0.0171229 0.2043878 -0.0968815 -0.0070153 0.0312031 0.0060564 0.0271232 -0.0414343 0.0949772 -0.0194602 -0.084018 0.0255926 -0.010092 0.0004427 -0.0189569 -0.115837 0.0381552 -0.0820065 -0.0073396 -0.0058529 -0.0212832 -0.020177 -0.0102586 -0.0049414 -0.1369575 -0.0732224 -0.1389543 0.0036561 -0.1541141 0.0670243 -0.0068754 0.0059313 -0.0074525 -0.1522754 -0.1159542 0.1151895 -0.0163203 0.2025825 0.0917539 -0.0357489 -0.0199064 -0.034388 -0.1459715 0.0737675 0.0030076 -0.0242956 -0.0101565 -0.0144846 -0.0103088 -0.0178063 -0.0140491 -0.1492872 -0.0970406 0.0404997 0.0588558 0.0356856 0.0639714 -0.0390809 0.0550673 -0.042809 -0.0318823 -0.0577065 -0.0389012 0.0240762 0.0729361 0.0858302 0.0231126 0.0744438 0.0909234 -0.1363954 -0.0389958 -0.0764167 -0.0290449 -0.0915992 -0.0165227 -0.060209 -0.1088876 -0.088772 0.0537666 0.106143 0.0194516 -0.0203089 0.0800242 -0.0937677 0.0868684 -0.0331742 0.028669 0.0584136 0.0034007 0.0607309 0.1151622 0.0512261 0.0519807 -0.0616066 0.0654117 -0.0330909 0.0179405 -0.1162487 -0.0978475 -0.0535711 -0.1581383 0.0318612 -0.0259796 -0.0673277 0.0099783 0.0458302 0.1136712 -0.0837136 0.0144117 -0.0467529 0.0107765 0.0189457 0.0124596 0.0205343 0.1486983 0.0599763 0.1023016 0.0071518 0.1093286 0.0065141 0.0141918 -0.0098564 0.0025063 0.1473365 -0.0030792 0.0935779 0.0044467 0.1136645 -0.0587666 0.0107941 0.0046838 0.0113484 0.1544154 0.0247567 -0.0731591 0.0181536 -0.1038947 -0.0728714 0.0305129 0.0213235 0.0298314 0.1531884 -0.1391349 -0.0080884 0.0263904 -0.0066537 0.0944432 0.0072733 0.026985 0.0064132 0.1571675 unknown
polarizability: 196.84924|3.2165163|129.1364639|-4.0796861|-5.0791272|68.6176566 unknown
InChI: InChI=1S/C10H11NS/c1-8-7-11-10(12-8)9-5-3-2-4-6-9/h2-6,8H,7H2,1H3
charge 0 multiplicity 1
23 atoms
S  -1.651308 1.427119 0.344786
N  -1.3014 -1.270729 0.330468
C  -3.211363 0.344858 0.11149
C  -2.749756 -1.07814 0.565787
C  -0.634152 -0.155057 0.244979
C  -3.684238 0.390253 -1.349848
C  0.833645 -0.0654 0.093722
C  1.608448 -1.25883 0.133297
C  1.489934 1.180968 -0.08414
C  3.009142 -1.200714 -0.002812
C  2.894202 1.235216 -0.216487
C  3.658183 0.046303 -0.176789
H  -3.976145 0.750466 0.794362
H  -2.936235 -1.221156 1.649749
H  -3.31716 -1.854794 0.021222
H  -3.896436 1.42389 -1.672728
H  -2.915013 -0.027583 -2.023281
H  -4.611277 -0.204266 -1.469735
H  1.088594 -2.211933 0.271532
H  0.902362 2.105277 -0.12758
H  3.597806 -2.124238 0.028556
H  3.390809 2.201962 -0.353376
H  4.748159 0.089528 -0.280576
