program: Gaussian 09
title: 000216600
version: EM64L-G09RevD.01
frameworkgroup: C1[X(C17H17IN2O)]
method: RPBEPBE
basis: SDD
operation: Freq
keyword: #p
keyword: freq=noraman
keyword: PBEPBE/SDD
title: #p freq=noraman PBEPBE/SDD
converged: NO YES NO NO
title: Mulliken charges:
elementType: I O N N C C C C C C C C C C C C C C C C C H H H H H H H H H H H H H H H H H
charge: 0.099060 -0.241482 -0.078328 -0.456051 -0.517377 0.065289 -0.408391 -0.490736 0.337799 0.337009 -0.419712 -0.623082 -0.379688 -0.241316 0.101685 0.308561 -0.495984 -0.336033 -0.158334 -0.225096 -0.217598 0.243295 0.201487 0.220588 0.191476 0.190804 0.236561 0.232564 0.226350 0.187369 0.229628 0.307962 0.227027 0.339455 0.272890 0.252616 0.239551 0.240184
chargesum: 0.00000
title: Mulliken charges with hydrogens summed into heavy atoms:
elementType: I O N N C C C C C C C C C C C C C C C C C
charge: 0.099060 -0.241482 -0.078328 -0.116596 -0.072595 0.065289 0.003673 -0.063370 0.337799 0.337009 -0.187148 0.020265 -0.071726 -0.014289 0.101685 0.308561 -0.495984 -0.063144 0.094281 0.014454 0.022586
polarizability: 3.07703298e+02 -1.00648952e+01 2.23929960e+02 -4.42365006e+01 -2.05305533e+00 1.57944582e+02
1716.lowfreq: -5.3869 -1.8470 -0.0007 -0.0004 -0.0001 6.7348 19.0270 28.2798 42.5275
frequency: 18.7701 28.2505 42.4474 60.0049 88.0356 92.9148 105.7074 138.0490 166.8457 196.0334 205.5742 227.9806 231.8211 252.3288 260.6066 291.0197 312.9166 323.8591 336.9605 396.9663 409.0955 436.3987 452.3879 475.7009 490.2075 521.7137 552.8091 577.2827 619.1575 627.2382 633.4663 659.9054 689.9229 719.1392 723.3496 736.9760 773.2720 795.6247 798.8113 808.5999 869.1904 877.7035 907.2635 914.1841 959.3222 967.1628 987.6468 989.8446 993.9393 994.0207 1000.1220 1039.4204 1045.7515 1073.9546 1083.2583 1111.4250 1115.0583 1121.6706 1140.9901 1175.8569 1178.4817 1188.9676 1194.0230 1217.8742 1233.5528 1244.0626 1266.1826 1269.4485 1288.6060 1295.4222 1332.9404 1347.9077 1355.4964 1375.8590 1385.2542 1409.6665 1430.5969 1439.1553 1447.3208 1451.2994 1457.1179 1463.4452 1465.2147 1479.6283 1481.0530 1521.5619 1560.5550 1588.9488 1597.0914 1604.7839 1613.7480 2794.0347 2831.0770 2856.0863 2950.1161 3002.3765 3008.9619 3020.7760 3037.7230 3079.5863 3119.5404 3138.9734 3149.8941 3151.4456 3164.8642 3176.0104 3197.6357 3527.5629
redmass: 6.2480 6.2812 6.2908 5.0945 4.5495 2.9491 4.3932 4.2992 5.0567 5.5151 2.5195 3.6872 1.4336 4.1783 3.6106 3.6958 2.7441 3.6336 2.8375 4.8956 3.8102 4.2859 4.1117 3.5258 3.8387 4.5285 2.9591 4.2650 3.7570 4.1421 1.7479 3.4794 6.3180 3.2505 4.0227 2.4498 1.6632 1.4800 2.6253 4.2484 3.4831 1.7370 2.4521 1.3705 1.4252 2.6544 2.0027 2.3673 1.6781 1.4750 3.0641 2.5664 1.8892 2.1873 1.9112 1.8994 1.3961 2.2714 2.1558 1.0620 1.2894 1.2207 2.1114 1.6484 1.8569 1.8475 1.6675 1.6977 2.6111 1.5080 1.6840 1.5229 8.9902 1.9899 2.5225 2.1202 1.3078 2.1541 2.4088 1.1427 1.3065 1.5774 1.1535 1.1463 1.0573 2.2286 5.7885 6.5656 7.2847 7.6929 4.1657 1.0711 1.0699 1.0582 1.0589 1.1000 1.0851 1.0722 1.0889 1.1010 1.0880 1.0859 1.0951 1.0904 1.0952 1.1006 1.0948 1.0758
irintensity: 0.6615 0.4795 2.2571 2.0942 2.6054 0.9466 0.7790 0.5350 1.3418 1.6720 2.0344 0.6273 0.2968 4.3357 1.2282 13.5275 5.6901 5.5292 3.2567 2.8040 0.4859 0.6645 8.3239 6.0879 4.6554 1.4788 6.9386 8.1551 8.4824 0.9854 28.5031 49.0168 5.0175 9.6273 0.5346 33.2328 44.0400 52.1945 7.4578 13.9764 15.7289 5.8857 10.7554 2.0094 0.6533 7.9165 25.0006 17.5403 5.7849 4.2415 5.6023 3.4910 10.1021 20.4523 4.2413 1.6861 2.2700 33.4502 27.2952 0.3144 4.9117 1.5255 2.2471 2.4829 14.9641 37.3356 7.5148 32.8536 46.8722 8.7631 0.5026 0.3397 4.6039 68.1721 52.7805 22.8561 8.1705 83.1305 16.9581 24.7898 66.0964 67.9345 46.6470 12.7926 8.0303 323.4416 13.4474 12.7116 191.0378 24.3179 10.8486 69.3018 63.9531 212.1528 25.8177 19.7407 23.6297 49.7014 40.3324 29.5496 9.5618 1.3764 28.2168 4.9901 7.2549 21.6824 7.4939 29.2989
temp: 298.150 k
press: 1.00000 atm
elementType: 53 8 7 7 6 6 6 6 6 6 6 6 6 6 6 6 6 6 6 6 6 1 1 1 1 1 1 1 1 1 1 1 1 1 1 1 1 1
symmnumber: 1
zpe: 789761.8 jmol-1
zpe.correction: 0.300804 hartree
zpe.thermalcorrener: 0.319803 hartree
zpe.thermalcorrenthalpy: 0.320747 hartree
zpe.thermalcorrgfe: 0.250979 hartree
zpe.sumelectzpe: -852.743168 hartree
zpe.sumelectthermal: -852.724170 hartree
zpe.sumelectthermalent: -852.723225 hartree
zpe.sumelectthermalfe: -852.792994 hartree
dipole: 0.3931 -3.3562 2.3866
dipole: 4.1369
quadrupole: -113.6401 -139.0847 -139.0652
quadrupole: -1.0557 -13.1754 1.9103
quadrupole: 16.9566 -8.4880 -8.4685 -1.0557 -13.1754 1.9103
hfenergy: -853.0439726 hartree
pointgroup: C01 [X(C17H17I1N2O1)]
dipole: -0.2330885 -1.5749569 -0.3380343 debye
polarizability: 312.4552023|-13.2665424|216.0480034|-34.5348207|-21.329167|161.0746342 unknown
InChI: InChI=1S/C17H17IN2O/c1-20-10-9-13-12(11-20)5-4-8-16(13)19-17(21)14-6-2-3-7-15(14)18/h2-8,19H,9-11H2,1H3
charge 0 multiplicity 1
38 atoms
I  2.115108 -1.530817 2.257807
O  1.888779 2.386562 -0.065286
N  -4.123083 -1.618721 -0.497218
N  0.513653 0.473284 -0.074838
C  -1.687188 -1.384422 -0.146275
C  -1.903043 0.118032 0.011077
C  -2.951911 -2.194121 0.195417
C  -4.434547 -0.274973 0.032947
C  -3.216974 0.639749 0.091807
C  -0.795661 1.026643 0.053764
C  -3.421777 2.033068 0.245459
C  -5.302441 -2.503033 -0.474571
C  -1.004658 2.420481 0.209096
C  -2.322865 2.911412 0.310078
C  1.740002 1.127102 -0.093013
C  2.946483 0.217992 -0.255801
C  3.277525 -0.916926 0.529337
C  3.856857 0.602753 -1.280586
C  4.451459 -1.665028 0.277131
C  5.024755 -0.136674 -1.545514
C  5.318227 -1.281348 -0.769878
H  -1.395245 -1.61181 -1.192099
H  -0.870606 -1.743011 0.515373
H  -2.823443 -3.240463 -0.136278
H  -3.098112 -2.211546 1.308085
H  -4.878632 -0.343265 1.064729
H  -5.206215 0.186389 -0.612143
H  -4.44461 2.424241 0.307351
H  -6.119093 -2.048545 -1.064085
H  -5.690787 -2.697272 0.558364
H  -5.049257 -3.474237 -0.935329
H  -0.145276 3.091288 0.239466
H  -2.485303 3.988276 0.427843
H  0.556869 -0.544727 -0.15622
H  3.620948 1.506443 -1.851898
H  4.695477 -2.529675 0.900579
H  5.702784 0.179656 -2.344667
H  6.2239 -1.867359 -0.959009
