program: Gaussian 09
title: 000211400
version: EM64L-G09RevD.01
frameworkgroup: C1[X(C21H25NO4)]
method: RPBEPBE
basis: SDD
operation: Freq
keyword: #p
keyword: freq=noraman
keyword: PBEPBE/SDD
title: #p freq=noraman PBEPBE/SDD
converged: YES YES NO NO
title: Mulliken charges:
elementType: O O O O N C C C C C C C C C C C C C C C C C C C C C H H H H H H H H H H H H H H H H H H H H H H H H H
charge: -0.277693 -0.281828 -0.270251 -0.279122 -0.046310 -0.046828 -0.517532 -0.480940 -0.436707 -0.342232 -0.419742 -0.302151 0.266409 0.179518 -0.326358 -0.332631 -0.258235 -0.251972 0.206923 0.213876 -0.580278 -0.341844 -0.335480 -0.221119 -0.217979 -0.223073 0.222561 0.251199 0.218927 0.223168 0.257824 0.229421 0.216560 0.230855 0.210062 0.227471 0.222218 0.284028 0.219516 0.245033 0.244597 0.222739 0.222994 0.216966 0.213348 0.309786 0.267363 0.271667 0.232318 0.231130 0.231827
chargesum: 0.00000
title: Mulliken charges with hydrogens summed into heavy atoms:
elementType: O O O O N C C C C C C C C C C C C C C C C C C C C C
charge: -0.277693 -0.281828 -0.270251 -0.279122 -0.046310 0.175733 -0.047406 0.000052 0.009274 0.098685 0.029948 0.201393 0.266409 0.179518 -0.081325 -0.088033 -0.035496 -0.028978 0.206923 0.213876 0.159822 -0.074481 -0.063813 0.011199 0.013151 0.008754
polarizability: 3.28156937e+02 1.37334812e+00 2.70084835e+02 -1.07512442e+01 1.62174047e+01 1.50579462e+02
1716.lowfreq: -2.5733 -0.0008 -0.0004 0.0003 5.9029 9.3131 17.5168 25.2604 34.0196
frequency: 17.4116 25.2319 33.9932 39.2975 40.7270 55.3715 69.5106 75.9844 85.7625 108.8861 114.2171 132.6594 158.0523 167.8682 202.3788 209.6759 215.6502 225.6533 263.4233 276.0155 291.8307 311.0841 321.6667 338.2802 378.4834 403.8023 415.4038 416.0301 442.7788 451.6364 460.7786 485.5943 514.5134 557.3373 560.3994 584.0539 614.0705 648.6207 662.3190 680.8012 702.6949 703.0115 722.5676 735.7033 740.0414 764.1312 776.0284 795.9907 801.6723 813.7329 825.6003 828.9628 858.2319 865.7470 889.9105 898.7455 908.2973 914.9921 937.2425 950.3933 953.6195 955.4681 974.8272 990.6229 996.8361 1008.3529 1008.5375 1021.1890 1038.9830 1045.2259 1047.0299 1064.2151 1075.8531 1086.3112 1093.9299 1105.0623 1110.7958 1117.7851 1138.5802 1163.3790 1173.3958 1173.7961 1181.6289 1184.0385 1188.5616 1194.9343 1212.6083 1215.1985 1242.9783 1247.8389 1273.8363 1274.7378 1276.7621 1282.1369 1294.9259 1300.4293 1311.7555 1314.1547 1326.2444 1328.4766 1378.1231 1389.6687 1393.9566 1402.5144 1428.9457 1437.8724 1443.8551 1447.9076 1453.6267 1472.9782 1475.0465 1477.1715 1477.8867 1480.6850 1489.3981 1492.3181 1493.4251 1581.3058 1593.2469 1597.8674 1609.4272 1613.5594 2933.4503 2956.2243 2988.0142 2992.6334 2998.3851 3002.8740 3015.2141 3020.9916 3025.6451 3046.6023 3063.2601 3071.0290 3088.8797 3089.9544 3107.3558 3123.7854 3129.5322 3132.5851 3142.2499 3147.5951 3154.9866 3161.7037 3167.0113 3173.7874 3179.7962
redmass: 5.5332 4.2465 4.5120 3.7711 5.0956 5.0570 5.3292 5.0781 3.1437 3.2550 2.9296 3.7633 3.6191 4.1665 3.2924 4.5119 3.7883 3.7342 1.8081 3.5143 3.2002 1.8174 3.7625 3.8196 2.8347 2.8351 3.0747 3.3650 3.6410 3.4710 3.3361 4.6411 4.9041 4.0937 4.1129 6.5582 6.4421 3.2903 5.8655 5.0095 1.6228 3.1474 3.7451 2.6223 1.2503 3.1043 1.7239 2.1931 6.4737 2.7656 1.8715 1.7895 3.8866 1.2440 1.8236 1.3880 2.8500 3.1131 2.5495 2.3863 1.3767 1.4198 8.8799 6.2403 1.3843 2.3164 1.4099 2.6046 2.3360 3.3174 2.1530 2.6250 2.1359 1.9844 2.4716 2.4936 2.1432 1.2509 1.9218 1.3092 1.0596 1.2753 1.1263 1.2372 1.2140 2.1498 1.3912 1.3888 2.9237 3.2338 1.3732 1.4010 1.1780 1.3416 1.2281 1.2060 1.3950 1.3202 1.4175 1.2423 1.4287 10.0672 8.7528 1.3028 1.9577 2.2425 1.0855 1.2671 1.0911 1.0894 1.1173 1.8071 1.1635 1.1429 1.1050 1.4774 1.4033 7.3023 6.1484 7.4169 7.5116 7.1953 1.0663 1.0321 1.0739 1.0657 1.0597 1.0755 1.0642 1.0668 1.0892 1.1036 1.1027 1.1004 1.1058 1.1041 1.0960 1.1017 1.0854 1.0848 1.0891 1.0899 1.0940 1.0939 1.0981 1.0986 1.0973
irintensity: 0.6470 0.0796 0.2997 0.0626 0.4864 0.4354 1.1387 1.3614 2.9317 4.4333 0.9931 2.0036 2.1398 4.4560 5.0628 0.7959 1.8938 1.2735 0.5941 3.9215 0.3934 1.2269 8.9336 9.1487 2.4765 0.0017 10.2298 9.6387 0.9499 10.0506 1.9779 2.9028 0.5586 2.1983 3.1110 2.0437 0.5049 11.1091 3.5867 13.4877 89.1383 8.6501 1.1356 35.7060 108.1730 7.8152 0.7591 23.0822 3.0910 1.6702 3.1015 3.0955 21.5265 0.0240 9.3399 4.3303 5.0588 46.2231 6.9936 25.1606 4.1109 4.1595 36.9785 0.8431 0.0227 6.5329 2.2344 68.7367 40.5120 7.0206 26.9663 203.1993 5.7054 29.9689 29.5772 3.9009 120.4381 0.6109 8.9837 15.3674 0.7518 20.4096 45.6423 7.0740 12.8687 78.0393 7.4949 12.3203 281.7458 320.0313 13.7861 26.2309 0.6013 6.4767 0.1259 2.9466 3.9045 2.0086 15.7317 11.9974 4.7755 2.9737 1.0678 5.7026 19.2446 14.4964 11.5327 41.5920 6.1067 13.4746 16.4745 16.5461 23.9504 20.0033 2.9550 59.2651 98.5265 79.5126 44.9747 8.6767 68.1106 103.2856 36.4157 60.2209 2.8039 62.4520 13.6323 68.8321 25.2261 50.1297 23.5688 45.7715 10.4860 13.8412 15.5716 63.1650 15.7644 10.8382 0.2270 0.2381 11.2959 23.6229 18.1261 27.3497 23.0883 12.3092 8.6939
temp: 298.150 k
press: 1.00000 atm
elementType: 8 8 8 8 7 6 6 6 6 6 6 6 6 6 6 6 6 6 6 6 6 6 6 6 6 6 1 1 1 1 1 1 1 1 1 1 1 1 1 1 1 1 1 1 1 1 1 1 1 1 1
symmnumber: 1
zpe: 1100745.8 jmol-1
zpe.correction: 0.419252 hartree
zpe.thermalcorrener: 0.443708 hartree
zpe.thermalcorrenthalpy: 0.444653 hartree
zpe.thermalcorrgfe: 0.362225 hartree
zpe.sumelectzpe: -1168.913438 hartree
zpe.sumelectthermal: -1168.888982 hartree
zpe.sumelectthermalent: -1168.888037 hartree
zpe.sumelectthermalfe: -1168.970465 hartree
dipole: -0.4136 -0.5162 -0.2590
dipole: 0.7103
quadrupole: -124.7252 -145.3111 -154.1592
quadrupole: 5.4025 -3.6441 2.7958
quadrupole: 16.6733 -3.9127 -12.7607 5.4025 -3.6441 2.7958
hfenergy: -1169.33269 hartree
pointgroup: C01 [X(C21H25N1O4)]
dipole: 0.1213258 0.1600197 -0.1943618 debye
polarizability: 323.4054257|22.4101382|235.7098171|12.8905269|-57.4134858|189.7059918 unknown
InChI: InChI=1S/C21H25NO4/c1-24-19-10-5-6-11-20(19)26-18-12-14-22(16-18)13-7-15-25-21(23)17-8-3-2-4-9-17/h2-6,8-11,18H,7,12-16H2,1H3
charge 0 multiplicity 1
51 atoms
O  2.555076 0.420047 -0.803807
O  -2.561675 0.363947 0.179147
O  1.643237 -1.247592 1.026763
O  -2.182364 -1.388773 1.668986
N  1.185317 3.104355 -1.473206
C  2.977863 1.472742 -1.762146
C  1.653819 2.008599 -2.36982
C  3.589527 2.715045 -1.04622
C  2.463033 3.812278 -1.150352
C  0.478374 2.629631 -0.237589
C  -0.898592 1.99174 -0.54487
C  -1.209271 0.917095 0.498843
C  3.527787 -0.360348 -0.166246
C  3.027233 -1.282388 0.810591
C  4.913383 -0.305244 -0.429989
C  3.927317 -2.139976 1.480646
C  5.807216 -1.168474 0.250875
C  5.315168 -2.084906 1.199498
C  -2.929839 -0.802387 0.841555
C  -4.295821 -1.264587 0.454574
C  1.088789 -2.181192 2.019631
C  -4.795218 -2.45124 1.051641
C  -5.091647 -0.554167 -0.481653
C  -6.079667 -2.924612 0.714284
C  -6.376552 -1.031421 -0.815662
C  -6.872646 -2.215703 -0.219983
H  3.647615 1.020676 -2.519624
H  0.909745 1.207081 -2.487687
H  1.865421 2.44077 -3.367512
H  4.522214 3.047417 -1.536113
H  3.831139 2.466734 0.001357
H  2.698355 4.508389 -1.977992
H  2.355245 4.403716 -0.225871
H  1.094864 1.898748 0.331932
H  0.334023 3.518241 0.404416
H  -1.69172 2.76022 -0.564848
H  -0.889389 1.518214 -1.542383
H  -0.464098 0.10225 0.471346
H  -1.247408 1.325208 1.526839
H  5.304245 0.409508 -1.160416
H  3.555425 -2.851407 2.223604
H  6.879314 -1.115429 0.034245
H  5.999789 -2.756113 1.728673
H  1.27331 -3.23119 1.719665
H  1.524994 -1.998931 3.021428
H  0.008518 -1.974893 2.031571
H  -4.162956 -2.980932 1.771879
H  -4.694407 0.358463 -0.934367
H  -6.463281 -3.840922 1.175841
H  -6.99089 -0.483546 -1.538422
H  -7.871014 -2.583942 -0.481948
