program: Gaussian 09
title: 000211398
version: EM64L-G09RevD.01
frameworkgroup: C1[X(C16H24N2O4)]
method: RPBEPBE
basis: SDD
operation: Freq
keyword: #p
keyword: freq=noraman
keyword: PBEPBE/SDD
title: #p freq=noraman PBEPBE/SDD
converged: YES YES NO NO
title: Mulliken charges:
elementType: O O O O N N C C C C C C C C C C C C C C C C H H H H H H H H H H H H H H H H H H H H H H H H
charge: -0.270795 -0.303810 -0.252941 -0.297413 -0.049240 -0.378711 -0.049837 -0.510623 -0.471437 -0.438930 -0.333735 -0.383711 -0.299755 0.267312 0.169142 -0.322476 -0.334109 -0.258645 -0.253187 0.311649 -0.538624 -0.607655 0.224603 0.249327 0.218588 0.255506 0.220570 0.224706 0.217093 0.222620 0.206654 0.238862 0.209473 0.224304 0.227125 0.248043 0.241215 0.223519 0.223661 0.221108 0.219703 0.243491 0.324307 0.271068 0.226115 0.225873
chargesum: 0.00000
title: Mulliken charges with hydrogens summed into heavy atoms:
elementType: O O O O N N C C C C C C C C C C C C C C C C
charge: -0.270795 -0.303810 -0.252941 -0.297413 -0.049240 -0.054404 0.174766 -0.042708 0.004638 0.002869 0.095539 0.064624 0.151674 0.267312 0.169142 -0.074433 -0.092893 -0.035126 -0.029526 0.311649 0.145677 0.115401
polarizability: 2.62362927e+02 -4.10042805e+00 2.07742554e+02 1.13124852e+01 1.55548961e+00 1.37002728e+02
1716.lowfreq: -7.7460 -0.0010 -0.0006 -0.0004 3.1635 8.8903 12.8264 16.8598 20.4543
frequency: 12.1460 16.5761 19.9173 32.9282 46.3018 48.4385 68.5526 82.4545 100.1750 101.0571 106.0457 141.7703 151.4220 169.0019 181.6210 211.1269 221.4258 242.4300 255.0637 287.0406 299.5168 316.9907 332.3221 337.9496 396.3173 417.7886 446.7280 461.8509 484.9359 543.0097 556.0818 559.8825 572.5285 583.1984 630.2581 645.4854 697.7414 702.8981 724.5334 739.9884 742.6762 766.7839 772.1159 812.4027 826.2862 832.3588 846.3651 856.6355 885.4534 899.1523 908.3263 936.7232 949.5127 954.9907 960.7131 984.7823 1019.1452 1040.0721 1047.2895 1047.5803 1067.0452 1086.9602 1099.2389 1110.6131 1111.6120 1112.4602 1126.3022 1145.0814 1149.4943 1155.2787 1171.6457 1185.1940 1192.7738 1195.2293 1205.2645 1215.5730 1228.1040 1243.4540 1273.9325 1275.6552 1280.9851 1288.0851 1294.9158 1305.8372 1314.1509 1325.8590 1329.5954 1371.7100 1387.8683 1394.8564 1426.8690 1428.0662 1441.3904 1445.1951 1453.2038 1454.1091 1464.0224 1466.3663 1471.2826 1471.6210 1474.6331 1483.3274 1484.2643 1492.7139 1518.1835 1592.7649 1599.4513 1674.6244 2922.2110 2955.6836 2975.4281 2982.5605 2984.5074 2999.2400 3004.0018 3016.7529 3018.4563 3021.7830 3042.5394 3051.0706 3065.7018 3070.1374 3087.4610 3096.8045 3103.8238 3109.8022 3121.6222 3133.0270 3148.1229 3161.4563 3172.6607 3579.1236
redmass: 5.3735 4.3895 4.0749 5.1089 4.2883 4.3150 3.5652 2.6896 1.4208 1.9987 2.8566 3.0305 2.9786 2.9991 3.6301 3.4094 3.0881 1.4413 3.7019 3.2318 3.2781 3.9308 3.4616 3.3999 2.0858 3.4907 3.2184 3.3234 4.7833 4.1334 4.1102 4.0069 1.1132 6.6146 4.7668 3.0317 11.6331 3.8134 3.6716 1.6449 2.1564 3.6055 1.2897 2.8147 1.5926 2.1309 2.5628 3.9710 1.5688 1.3984 2.7525 2.6303 2.5732 1.3457 5.2254 8.6090 2.6258 2.2817 2.1068 3.8204 2.7236 2.9001 1.9747 3.8490 1.2990 2.0972 1.2825 1.7685 1.4706 1.9136 1.0858 1.3115 1.2909 2.3550 2.2257 1.3986 1.3546 2.9413 1.3664 1.3949 1.3405 1.1425 1.2157 1.2036 1.3576 1.3521 1.3102 1.2672 1.3639 8.7468 1.6128 1.1649 1.4805 1.0868 1.0958 1.1343 1.2408 1.0551 1.0801 1.1160 1.0916 1.1060 1.0451 2.2832 1.4404 6.1349 7.4771 8.3455 1.0665 1.0330 1.0355 1.0700 1.0702 1.0768 1.0611 1.0609 1.0663 1.0886 1.1037 1.1026 1.1026 1.0996 1.1028 1.1078 1.0962 1.0978 1.0992 1.0848 1.0896 1.0931 1.0996 1.0772
irintensity: 0.0529 0.1813 1.1850 0.7401 5.1936 1.9591 2.4702 3.6195 1.0029 2.4094 0.5619 4.1091 3.8466 3.2374 1.7247 1.3368 2.1474 0.0257 0.6052 0.0471 1.5499 8.5981 14.5672 23.2421 5.1773 5.8873 7.2691 1.2108 2.2628 5.4627 2.7482 0.4187 133.4547 2.5814 8.7306 8.6688 19.4248 6.5640 2.1787 77.2521 70.7292 2.8688 3.1687 0.6249 0.8963 8.2212 3.3493 27.4845 3.8373 5.0216 4.7162 39.9506 34.8687 3.1999 72.6693 38.9768 5.2812 19.0027 20.0078 14.6913 2.0105 112.6378 16.6855 190.0351 9.5699 120.9551 0.0339 11.6321 15.6465 15.0768 3.9209 5.8493 44.5981 98.3089 292.5317 6.3532 3.9569 197.2050 3.4756 8.0188 4.4745 6.6673 0.0128 4.3466 1.9219 10.9361 20.1801 5.4702 12.2956 1.2084 10.2610 31.6445 25.8696 15.5272 5.7059 15.2353 133.9297 13.9313 6.3113 66.7526 11.7455 8.8280 14.8800 135.6060 175.0052 51.7939 9.2318 258.1910 37.5317 70.3719 92.5416 16.3887 50.9255 66.9264 11.4446 47.5773 45.2546 20.6367 47.9874 41.6538 8.0947 17.6126 38.4764 36.1589 15.3054 4.1901 23.1009 0.4111 19.2456 28.2040 12.6649 33.6269
temp: 298.150 k
press: 1.00000 atm
elementType: 8 8 8 8 7 7 6 6 6 6 6 6 6 6 6 6 6 6 6 6 6 6 1 1 1 1 1 1 1 1 1 1 1 1 1 1 1 1 1 1 1 1 1 1 1 1
symmnumber: 1
zpe: 1006930.9 jmol-1
zpe.correction: 0.383520 hartree
zpe.thermalcorrener: 0.406632 hartree
zpe.thermalcorrenthalpy: 0.407576 hartree
zpe.thermalcorrgfe: 0.326357 hartree
zpe.sumelectzpe: -1032.763592 hartree
zpe.sumelectthermal: -1032.740479 hartree
zpe.sumelectthermalent: -1032.739535 hartree
zpe.sumelectthermalfe: -1032.820754 hartree
dipole: -1.5613 -1.9242 1.3710
dipole: 2.8319
quadrupole: -117.6950 -114.5719 -132.9713
quadrupole: -12.6331 14.2942 1.8400
quadrupole: 4.0511 7.1742 -11.2252 -12.6331 14.2942 1.8400
hfenergy: -1033.1471114 hartree
pointgroup: C01 [X(C16H24N2O4)]
dipole: 0.6321111 -0.8693438 0.2932656 debye
polarizability: 261.2140811|0.8958049|151.3926252|-11.9644843|-29.8678089|194.5015027 unknown
InChI: InChI=1S/C16H24N2O4/c1-17-16(19)21-11-5-9-18-10-8-13(12-18)22-15-7-4-3-6-14(15)20-2/h3-4,6-7,13,17H,5,8-12H2,1-2H3
charge 0 multiplicity 1
46 atoms
O  1.649798 -0.340998 -1.007074
O  -3.703152 -0.478176 1.47562
O  1.894333 -1.150582 1.491778
O  -5.119624 1.412737 1.328623
N  -0.759366 1.267699 -2.171663
N  -5.938887 -0.75473 1.742849
C  1.419102 0.183153 -2.378908
C  -0.104484 0.012542 -2.631979
C  1.6502 1.7219 -2.463872
C  0.202695 2.321672 -2.608791
C  -1.070963 1.298058 -0.708086
C  -2.308333 0.437849 -0.375738
C  -2.536683 0.381708 1.140912
C  2.963692 -0.451434 -0.538792
C  3.098365 -0.907498 0.813067
C  4.123266 -0.164296 -1.29255
C  4.385145 -1.077739 1.368504
C  5.409944 -0.337989 -0.725605
C  5.541207 -0.795261 0.599014
C  -4.953403 0.176062 1.497172
C  1.993667 -1.631646 2.871076
C  -7.350958 -0.383479 1.846113
H  2.037667 -0.40008 -3.089006
H  -0.50148 -0.878333 -2.122166
H  -0.273661 -0.099971 -3.72124
H  2.151398 2.07438 -1.546044
H  2.290614 1.993406 -3.322194
H  0.006003 2.559361 -3.672542
H  0.060182 3.244986 -2.023165
H  -0.208552 0.965653 -0.086238
H  -1.292056 2.350476 -0.446985
H  -3.19525 0.86335 -0.878116
H  -2.170827 -0.592984 -0.752469
H  -1.689942 -0.101469 1.657429
H  -2.711062 1.391284 1.556136
H  4.032072 0.202187 -2.31918
H  4.497673 -1.428241 2.39879
H  6.298064 -0.111293 -1.324793
H  6.532702 -0.931225 1.043491
H  2.525071 -2.602194 2.923681
H  2.504739 -0.894621 3.521554
H  0.953072 -1.761085 3.203456
H  -5.645625 -1.72515 1.854618
H  -7.426543 0.701791 1.672526
H  -7.961752 -0.90624 1.086537
H  -7.757369 -0.609737 2.849851
