program: Gaussian 09
title: 000211396
version: EM64L-G09RevD.01
frameworkgroup: C1[X(C13H17NO)]
method: RPBEPBE
basis: SDD
operation: Freq
keyword: #p
keyword: freq=noraman
keyword: PBEPBE/SDD
title: #p freq=noraman PBEPBE/SDD
converged: YES YES NO NO
title: Mulliken charges:
elementType: O N C C C C C C C C C C C C C H H H H H H H H H H H H H H H H H
charge: -0.440609 -0.056743 -0.145510 -0.287628 -0.472206 -0.417021 -0.580954 -0.408631 0.386285 0.292486 -0.635500 -0.590875 -0.363694 0.293310 -0.422846 0.237519 0.220548 0.214412 0.206170 0.211300 0.205427 0.226520 0.223731 0.205938 0.208388 0.185118 0.219361 0.225483 0.260975 0.231005 0.216855 0.351386
chargesum: 0.00000
title: Mulliken charges with hydrogens summed into heavy atoms:
elementType: O N C C C C C C C C C C C C C
charge: -0.089223 -0.056743 0.075038 -0.050109 -0.051624 -0.000294 -0.130704 0.005695 0.386285 0.292486 -0.005539 -0.329900 -0.132688 0.293310 -0.205990
polarizability: 1.80706565e+02 -1.03204429e+00 1.42794793e+02 -9.57891220e+00 -1.17888831e+00 1.03877606e+02
1716.lowfreq: -16.4296 -7.8333 -0.0008 -0.0007 -0.0005 20.7960 51.9042 98.8053 124.7407
frequency: 51.6614 98.7869 124.7037 199.3235 214.2225 245.8483 255.4251 296.8348 326.3646 345.7996 349.5252 356.5955 380.4749 415.4379 446.8760 460.0779 482.2725 488.5272 553.8199 592.9949 648.2343 688.4595 698.6839 718.4719 749.9980 792.6229 802.9202 844.7527 861.7663 885.3690 894.0515 919.3628 932.8498 938.6238 963.8278 1016.4498 1043.1794 1050.0084 1067.8352 1104.8610 1116.2465 1121.6922 1133.4654 1141.8030 1145.2569 1156.0520 1172.8109 1198.9292 1206.7765 1224.9362 1235.8083 1258.1335 1269.2887 1285.0739 1295.7158 1322.5079 1333.5059 1345.8648 1354.9833 1361.2016 1374.0736 1390.2329 1432.6113 1441.3218 1446.1399 1454.3169 1463.0594 1464.5236 1480.4355 1494.1408 1494.8659 1590.8859 1630.2873 2845.4101 2867.4882 2956.6810 2982.5796 2988.1628 2996.9601 3004.1297 3005.7088 3007.7948 3014.7649 3051.2996 3060.9524 3066.9664 3104.4407 3128.3453 3142.3264 3579.6367
redmass: 4.0316 3.9187 2.8793 2.4438 1.4426 3.1189 2.1760 3.4201 2.8406 2.6978 1.1285 2.5919 2.3165 3.9029 2.8930 3.3284 4.4889 3.7422 2.7112 4.2661 4.0634 5.0259 3.2684 4.0770 3.7206 1.4354 1.9905 2.7854 2.4691 1.7665 1.7066 2.9308 1.4807 2.5084 2.3914 1.9116 1.8924 1.9840 1.9468 1.3806 1.3598 1.6677 1.6683 1.9386 1.5227 1.2540 1.3830 1.7974 1.5149 1.6787 1.5082 2.2561 1.9220 1.5072 1.6811 1.6576 1.3901 1.4914 1.4525 1.4337 1.5106 4.3807 1.1684 1.6447 1.1469 1.3710 1.0913 1.1665 1.0738 2.7083 1.0875 7.0269 6.5481 1.0586 1.0698 1.0625 1.0663 1.0707 1.0808 1.0938 1.0716 1.0809 1.0827 1.1035 1.1030 1.1006 1.0867 1.0966 1.0919 1.0660
irintensity: 0.1235 0.1832 2.0178 2.6170 0.4671 5.6483 2.3937 0.6040 2.6595 9.2193 133.6621 0.8087 0.6540 5.9030 9.2325 5.5041 2.1473 5.4931 0.6901 3.9044 4.3266 4.5241 10.0788 2.8765 2.0488 37.3084 12.9975 0.4254 0.5030 6.3252 12.8601 38.7175 3.4090 1.9828 16.6380 6.0504 34.2943 18.1064 6.9755 23.1674 14.8884 30.1522 2.9280 19.3542 52.5923 40.7236 53.9602 11.7383 6.4939 5.8581 4.1215 35.0705 8.3574 8.2676 13.7865 25.9836 1.1489 1.3196 0.4858 6.6332 9.4184 15.4207 7.8622 11.4291 4.1828 8.3943 21.1571 9.0797 4.4614 87.2606 10.6348 22.2373 48.5308 86.9942 105.8830 22.4589 9.6048 4.7169 91.1592 1.0756 78.5382 96.1502 62.7000 29.7607 51.1931 35.3211 16.2246 26.2518 4.1850 33.3992
temp: 298.150 k
press: 1.00000 atm
elementType: 8 7 6 6 6 6 6 6 6 6 6 6 6 6 6 1 1 1 1 1 1 1 1 1 1 1 1 1 1 1 1 1
symmnumber: 1
zpe: 717451.3 jmol-1
zpe.correction: 0.273263 hartree
zpe.thermalcorrener: 0.285967 hartree
zpe.thermalcorrenthalpy: 0.286911 hartree
zpe.thermalcorrgfe: 0.235127 hartree
zpe.sumelectzpe: -634.426322 hartree
zpe.sumelectthermal: -634.413618 hartree
zpe.sumelectthermalent: -634.412674 hartree
zpe.sumelectthermalfe: -634.464458 hartree
dipole: 0.1007 1.9408 -0.3564
dipole: 1.9758
quadrupole: -85.2462 -85.7074 -90.2212
quadrupole: 5.1682 -2.3018 -1.0131
quadrupole: 1.8121 1.3509 -3.1630 5.1682 -2.3018 -1.0131
hfenergy: -634.699585 hartree
pointgroup: C01 [X(C13H17N1O1)]
dipole: 0.0575092 -0.760925 0.1482153 debye
polarizability: 180.6402776|2.0199313|142.8395995|9.5715666|-1.3642102|103.8990872 unknown
InChI: InChI=1S/C13H17NO/c1-14-5-4-10-7-11(14)6-9-2-3-12(15)8-13(9)10/h2-3,8,10-11,15H,4-7H2,1H3
charge 0 multiplicity 1
32 atoms
O  4.247226 0.748302 0.508674
N  -2.76554 -0.042604 0.407792
C  -2.08956 -0.51441 -0.836352
C  -0.499732 1.421765 -0.712008
C  -1.545112 0.710461 -1.603005
C  -1.217469 1.905061 0.58671
C  -0.934227 -1.547928 -0.628784
C  -1.890742 0.730069 1.323303
C  0.651091 0.473644 -0.379496
C  0.42916 -0.932574 -0.310179
C  -3.535085 -1.083576 1.108588
C  1.933941 0.997743 -0.100339
C  1.514488 -1.772787 0.038341
C  2.999626 0.14354 0.247901
C  2.795761 -1.255291 0.32056
H  -0.094241 2.308165 -1.23661
H  -2.876634 -1.005704 -1.441633
H  -2.381767 1.396459 -1.828996
H  -1.0900 0.38464 -2.557856
H  -1.98861 2.647996 0.305546
H  -0.495293 2.398084 1.264565
H  -0.84475 -2.152455 -1.555414
H  -1.218128 -2.263905 0.168781
H  -1.106484 0.086333 1.795106
H  -2.520119 1.12143 2.145909
H  -2.907282 -1.860257 1.615852
H  -4.200229 -1.600446 0.3928
H  -4.167013 -0.613379 1.884788
H  2.120543 2.076025 -0.154241
H  1.355127 -2.857264 0.092342
H  3.620147 -1.928762 0.5902
H  4.924006 0.06343 0.736255
