program: Gaussian 09
title: 000211393
version: EM64L-G09RevD.01
frameworkgroup: C1[X(C19H24N2O5)]
method: RPBEPBE
basis: SDD
operation: Freq
keyword: #p
keyword: freq=noraman
keyword: PBEPBE/SDD
title: #p freq=noraman PBEPBE/SDD
converged: YES YES NO NO
title: Mulliken charges:
elementType: O O O O O N N C C C C C C C C C C C C C C C C C C C H H H H H H H H H H H H H H H H H H H H H H H H
charge: -0.470438 -0.296781 -0.289820 -0.222472 -0.282481 -0.097654 -0.001652 -0.137906 0.443623 0.408805 0.207300 -0.535702 -0.423392 -0.283627 -0.351896 0.203767 -0.273193 -0.478239 -0.329650 0.213350 -0.204235 -0.615839 -0.614101 -0.342562 -0.520442 -0.535741 0.291602 0.277659 0.239138 0.242710 0.224920 0.221371 0.263083 0.373806 0.240994 0.291930 0.229307 0.227787 0.193144 0.226493 0.227026 0.197685 0.230517 0.238367 0.259468 0.230397 0.207551 0.221483 0.230114 0.244429
chargesum: 0.00000
title: Mulliken charges with hydrogens summed into heavy atoms:
elementType: O O O O O N N C C C C C C C C C C C C C C C C C C C
charge: -0.096633 -0.296781 -0.289820 -0.222472 -0.282481 -0.097654 -0.001652 -0.137906 0.443623 0.408805 0.207300 -0.244101 -0.145733 0.198221 0.094395 0.203767 -0.010110 -0.186309 -0.088656 0.213350 0.025073 0.031585 0.041127 -0.104195 0.176974 0.160285
polarizability: 2.35140706e+02 4.29042805e+00 2.76004196e+02 -3.82570378e+00 -6.90670038e+00 2.09441240e+02
1716.lowfreq: -11.9214 -3.8454 -0.0006 0.0002 0.0007 2.6123 11.9008 17.4772 21.2713
frequency: 11.5710 17.3996 21.2567 28.1236 30.6676 43.7786 58.4756 63.9987 79.0278 92.8155 105.2945 113.4175 122.6052 151.0929 176.0724 184.9667 199.3540 211.5996 215.3291 222.1341 237.3132 242.5849 252.7403 264.0409 291.1521 300.7987 326.0293 336.8842 345.6254 355.3992 375.9151 385.7853 393.6522 413.6695 416.9495 457.4569 468.2323 483.7515 507.5534 523.4783 581.2279 592.8720 613.0507 635.4600 655.9465 699.4242 713.2004 719.2111 731.4399 739.1188 786.5506 803.7601 809.5253 821.0579 823.6175 852.6027 907.5576 921.4604 931.3295 944.1140 950.6231 962.7003 981.6282 984.2722 991.9101 1006.6331 1025.0500 1031.6167 1032.5981 1037.8387 1063.1153 1070.8623 1091.3583 1104.7954 1110.6001 1112.4515 1120.2356 1136.6302 1139.8190 1144.1680 1155.4956 1161.1095 1175.4454 1185.7728 1198.5556 1202.9801 1250.0351 1258.4653 1268.0747 1272.8549 1298.4941 1306.1698 1319.3563 1325.5911 1336.1591 1369.4853 1377.1920 1392.9619 1410.4560 1423.2828 1430.7065 1440.2069 1442.5370 1451.4553 1452.8535 1455.7502 1462.7531 1466.0614 1470.7366 1472.0105 1477.3168 1480.8527 1481.5038 1488.1728 1491.0112 1556.5443 1576.0139 1582.8842 1607.3039 1640.3433 2863.3885 2874.3910 2898.7136 2963.4033 2972.9228 3022.4055 3031.4831 3043.5314 3049.7099 3053.5273 3080.6633 3082.8452 3090.2442 3125.9987 3126.9987 3127.9000 3136.6317 3150.3611 3151.6620 3153.7342 3174.1751 3176.7864 3181.0322 3529.6913
redmass: 4.9176 4.3793 4.9028 4.3082 2.6439 4.5870 4.0345 2.1021 3.6979 3.7653 3.2118 5.4793 2.4311 2.0784 2.8335 3.5552 2.7027 1.6569 2.8332 1.6444 1.3654 2.9650 2.6801 2.3732 4.3316 4.9036 4.8607 2.4529 2.8719 3.3721 2.7847 3.5000 3.2440 2.1641 2.4476 4.3736 3.7790 4.1275 4.4364 7.7233 5.3575 6.5767 7.4916 5.7332 6.8004 5.8297 5.3695 2.2110 3.3590 3.8290 1.7763 2.0710 1.7732 2.5852 3.4372 3.3889 3.2635 1.8889 1.3528 2.8503 1.3866 2.1694 4.6016 1.6643 4.6182 3.7291 4.7578 2.9433 2.5224 1.6314 2.0601 2.1913 1.3141 2.4502 1.2584 1.2378 2.0931 2.7014 1.5532 1.8275 1.3781 1.6675 1.9317 1.6572 2.0882 1.3489 4.1888 1.5713 1.4311 2.4110 1.2226 7.4528 1.5168 1.3284 1.3288 5.5457 1.3432 3.4991 2.1260 1.1398 1.2100 1.2596 1.1332 1.9867 1.1521 1.0732 1.0493 1.0506 1.0575 1.1092 1.0584 1.0822 1.0617 1.0544 2.3389 5.7808 7.7781 5.7440 6.5571 10.7562 1.0561 1.0569 1.0686 1.0326 1.0355 1.0737 1.0744 1.0794 1.0703 1.1042 1.1007 1.0960 1.1005 1.0999 1.1045 1.0884 1.1079 1.0904 1.0888 1.0921 1.0968 1.0952 1.0932 1.0648
irintensity: 0.7943 1.6703 0.8580 0.5881 0.1317 1.9693 2.6595 5.5242 1.3839 3.1850 1.5740 2.0511 4.2619 0.4230 5.8113 1.4997 0.2060 0.4257 0.7115 1.2943 0.3218 0.5868 6.2427 0.3789 12.1919 4.9926 11.4794 64.4266 14.3346 15.3922 5.6648 14.4113 3.3379 62.2402 20.4205 7.6110 13.4874 1.3417 7.4544 4.5697 4.7987 15.5672 13.0372 1.6189 8.9693 8.9373 18.6577 36.2247 11.0099 6.4474 34.2018 2.0786 37.6249 11.3963 10.1807 32.6629 48.9857 13.2168 0.2305 92.6126 6.9776 31.8785 30.3094 6.1090 56.9395 33.4603 23.5963 54.4899 9.5848 29.8830 4.9355 48.3387 13.1699 89.6419 0.2930 6.5089 67.9410 192.1105 24.2223 96.1285 3.6684 34.3298 22.1784 2.3328 39.1964 16.3121 252.2476 8.4629 7.5239 15.9134 0.9521 2.7257 13.4230 1.8012 54.0446 40.4330 6.0357 7.3616 41.2314 2.1658 1.3719 18.0484 1.6328 28.9542 12.9868 16.2241 14.6484 15.1247 8.2339 85.3043 34.5516 12.3217 32.4565 10.7525 114.7936 18.5144 21.4943 0.6554 10.8877 88.1125 82.9484 115.3288 101.4249 68.3456 85.8187 44.4610 39.0034 22.1676 25.6344 41.3420 29.1740 40.1205 41.4469 22.5429 16.0182 14.2722 11.8779 3.1023 5.9095 27.7722 10.1410 5.5108 0.1816 53.6388
temp: 298.150 k
press: 1.00000 atm
elementType: 8 8 8 8 8 7 7 6 6 6 6 6 6 6 6 6 6 6 6 6 6 6 6 6 6 6 1 1 1 1 1 1 1 1 1 1 1 1 1 1 1 1 1 1 1 1 1 1 1 1
symmnumber: 1
zpe: 1050241.0 jmol-1
zpe.correction: 0.400016 hartree
zpe.thermalcorrener: 0.427350 hartree
zpe.thermalcorrenthalpy: 0.428294 hartree
zpe.thermalcorrgfe: 0.338232 hartree
zpe.sumelectzpe: -1222.017723 hartree
zpe.sumelectthermal: -1221.990389 hartree
zpe.sumelectthermalent: -1221.989445 hartree
zpe.sumelectthermalfe: -1222.079507 hartree
dipole: -1.4468 -6.6895 -1.2046
dipole: 6.9494
quadrupole: -133.2484 -157.0376 -149.7964
quadrupole: -9.9802 -2.0473 11.3057
quadrupole: 13.4457 -10.3435 -3.1022 -9.9802 -2.0473 11.3057
hfenergy: -1222.4177391 hartree
pointgroup: C01 [X(C19H24N2O5)]
dipole: 0.5039815 2.6682741 0.3188231 debye
polarizability: 238.3576305|12.8440009|271.2110285|1.8274642|-11.4415323|211.0174826 unknown
InChI: InChI=1S/C19H24N2O5/c1-21(2)10-11-26-18(22)19(23,15-6-5-9-20-13-15)14-7-8-16(24-3)17(12-14)25-4/h5-9,12-13,23H,10-11H2,1-4H3
charge 0 multiplicity 1
50 atoms
O  -0.884755 -1.868925 2.249599
O  -2.647794 -0.405064 1.059653
O  2.052253 1.691419 -1.77614
O  -2.048411 -1.025623 -1.106709
O  4.059911 1.774809 0.252769
N  -4.661085 2.454575 -0.387981
N  -0.282014 -5.472708 0.4722
C  -0.588708 -1.65197 0.831884
C  0.613864 -0.68022 0.683905
C  -0.282997 -3.031459 0.218247
C  -1.822931 -1.024525 0.120801
C  0.801156 0.145559 -0.44992
C  1.582046 -0.659473 1.712704
C  -3.848302 0.320408 0.535653
C  -3.474603 1.769051 0.167862
C  1.936008 0.975231 -0.572457
C  0.227324 -3.15866 -1.096042
C  -0.520823 -4.216736 0.958564
C  2.724803 0.159241 1.600895
C  2.925036 0.971305 0.4593
C  0.472813 -4.447847 -1.613277
C  -4.718852 3.895996 -0.074868
C  -4.87076 2.186134 -1.826857
C  0.205418 -5.572216 -0.799355
C  2.373155 3.131751 -1.704302
C  5.126202 1.709875 1.256945
H  0.078635 0.17096 -1.272254
H  1.431725 -1.288391 2.594238
H  -4.234359 -0.235222 -0.33534
H  -4.574352 0.294725 1.360843
H  -2.6094 1.763546 -0.537509
H  -3.150324 2.295128 1.083506
H  0.431244 -2.273122 -1.70413
H  -1.479206 -1.13041 2.545729
H  3.46842 0.1468 2.403367
H  -0.907612 -4.151946 1.978005
H  0.86435 -4.581003 -2.626603
H  -4.652131 4.047088 1.016932
H  -3.905872 4.492222 -0.560554
H  -5.68681 4.306499 -0.414833
H  -5.856541 2.576501 -2.136422
H  -4.089219 2.656405 -2.474358
H  -4.860337 1.100718 -2.023615
H  0.383779 -6.590169 -1.165225
H  3.371906 3.294863 -1.269008
H  2.341439 3.477766 -2.748718
H  1.608798 3.667818 -1.1082
H  4.776795 2.074688 2.242296
H  5.516618 0.679208 1.357612
H  5.917497 2.371799 0.875568
