program: Gaussian 09
title: 000211391
version: EM64L-G09RevD.01
frameworkgroup: C1[X(C10H10BrN3S)]
method: RPBEPBE
basis: SDD
operation: Freq
keyword: #p
keyword: freq=noraman
keyword: PBEPBE/SDD
title: #p freq=noraman PBEPBE/SDD
converged: YES YES NO NO
title: Mulliken charges:
elementType: Br S N N N C C C C C C C C C C H H H H H H H H H H
charge: -0.015790 0.267448 -0.117827 -0.634244 -0.660753 0.627197 -0.412577 -0.081238 -0.414815 -0.480488 -0.371583 -0.258577 -0.198285 -0.205263 0.221055 0.254261 0.225562 0.219214 0.258668 0.246409 0.249683 0.328266 0.297977 0.315849 0.339850
chargesum: 0.00000
title: Mulliken charges with hydrogens summed into heavy atoms:
elementType: Br S N N N C C C C C C C C C C
charge: -0.015790 0.267448 -0.117827 -0.008001 -0.005054 0.627197 -0.412577 -0.081238 -0.160554 -0.035712 -0.112914 -0.012167 -0.198285 0.044420 0.221055
polarizability: 3.03137846e+02 -2.95444190e-01 1.50914572e+02 -4.94348971e-01 -1.49603473e+00 6.65028698e+01
1716.lowfreq: -8.9333 -2.9725 -0.0007 0.0014 0.0015 5.2764 18.1898 30.1262 60.1480
frequency: 18.1057 30.1026 60.1411 78.4463 130.0485 144.5801 182.3386 207.7915 244.8567 251.5500 279.5519 305.3907 358.3963 397.3633 407.3614 420.0695 427.7255 468.5958 484.2913 518.2500 531.9177 553.5288 566.9569 585.4342 631.3638 670.8104 682.1251 703.5088 730.5231 800.4526 831.0154 869.8162 891.0611 901.1662 945.1877 968.0841 1002.0085 1033.7611 1037.6135 1053.9476 1129.3020 1146.3863 1176.1190 1201.1813 1205.8130 1249.1749 1266.5579 1328.1563 1381.9616 1411.7476 1421.5835 1439.8811 1444.3701 1540.4923 1581.1282 1588.6593 1603.8246 1620.2090 1673.7923 2870.6375 2906.8365 3146.0428 3159.0638 3161.2172 3174.8994 3531.3200 3556.1915 3678.8336 3701.5437
redmass: 5.3272 4.3196 6.0970 5.8575 6.0434 8.0789 6.0776 2.4782 4.9471 8.4033 6.1428 5.9579 1.1657 2.4579 1.5003 1.4970 2.1906 2.3159 3.8428 8.8456 4.8145 1.9773 1.9364 3.7468 4.6987 5.8139 5.9696 7.6334 3.4666 1.3421 1.3319 5.4332 1.6712 4.8794 1.3432 1.8201 2.5870 1.4766 5.6015 2.0495 2.6137 1.3773 1.5586 1.1850 2.0567 1.9350 1.6705 1.4801 7.1558 3.1563 4.2305 2.6697 1.2146 7.3287 7.3057 7.6239 1.2308 1.2685 3.9200 1.0547 1.1010 1.0893 1.0933 1.0941 1.0962 1.0450 1.0457 1.1025 1.1029
irintensity: 0.2115 5.3388 2.4918 0.1340 0.1224 0.1944 3.5996 10.7715 3.9372 9.1889 4.0680 0.0197 99.8337 53.8931 232.9589 36.0381 22.6614 40.5571 17.7987 1.3885 0.5185 147.9205 121.6880 0.6677 15.4295 23.1099 41.1644 17.8600 3.2652 43.1802 9.4000 38.5356 41.3733 25.5842 0.2956 1.0080 11.3644 4.6776 30.1441 37.6574 15.0095 8.8292 0.0999 1.0527 26.7922 0.4896 19.3123 127.5590 5.3402 9.6036 120.8451 59.6740 4.4434 7.0270 18.2609 37.3120 148.6919 79.1087 860.3843 49.5511 38.4005 3.3890 1.6144 8.9465 5.4801 29.5706 26.4987 22.1598 20.1043
temp: 298.150 k
press: 1.00000 atm
elementType: 35 16 7 7 7 6 6 6 6 6 6 6 6 6 6 1 1 1 1 1 1 1 1 1 1
symmnumber: 1
zpe: 482706.1 jmol-1
zpe.correction: 0.183853 hartree
zpe.thermalcorrener: 0.198657 hartree
zpe.thermalcorrenthalpy: 0.199601 hartree
zpe.thermalcorrgfe: 0.139450 hartree
zpe.sumelectzpe: -961.762350 hartree
zpe.sumelectthermal: -961.747546 hartree
zpe.sumelectthermalent: -961.746601 hartree
zpe.sumelectthermalfe: -961.806753 hartree
dipole: 7.2718 -1.9176 0.0456
dipole: 7.5205
quadrupole: -68.4250 -88.4166 -111.2676
quadrupole: -11.4291 -0.5997 -0.3806
quadrupole: 20.9448 0.9531 -21.8979 -11.4291 -0.5997 -0.3806
hfenergy: -961.9462028 hartree
pointgroup: C01 [X(C10H10Br1N3S1)]
dipole: -2.9193599 0.2772567 0.3936597 debye
dipolederiv: -0.7581326 -0.1554492 -0.1293368 -0.208731 -0.1169844 -0.0516401 -0.1852828 -0.0545655 -0.1069995 0.1405853 0.0363199 0.0685456 -0.0071236 -0.0461775 -0.157257 0.0390906 -0.1650407 -0.0808863 -1.8808784 -0.0414087 -0.2649293 0.1426838 -0.3952115 0.0093053 -0.0930561 -0.0251072 -0.4046254 -0.9064582 -0.044049 -0.4529827 -0.0268563 -0.6511467 0.0181554 -0.7734061 -0.0784293 -0.9084556 -1.0631629 0.0168606 0.3596383 0.1828828 -0.7372874 -0.0773025 0.5852975 -0.1378719 -0.6403318 0.264073 -0.0107389 -0.0271582 -0.2257451 -0.0041922 -0.0818882 -0.2621649 -0.0947877 -0.0114101 0.3901354 0.100752 0.0799538 0.2763653 -0.1271834 -0.0107475 0.2649601 0.0031881 -0.1442078 0.3233296 -0.0095647 -0.042971 0.0069858 0.1418437 0.3166171 -0.1098689 0.3413679 0.1965566 -0.5953296 -0.100474 -0.0979207 -0.1176387 -0.1644661 0.0624607 -0.1140934 0.0556698 -0.1375482 0.529739 0.0517032 0.1252806 0.1999249 0.2935712 -0.0997019 0.3807131 -0.0903514 0.2873156 -0.4189446 -0.039584 -0.0267334 -0.1113661 -0.0692274 0.0721158 -0.1002675 0.0680917 -0.0459422 0.0491754 -0.0050352 -0.017784 -0.1404463 -0.0171173 0.1069282 -0.1689954 0.1023298 0.0085333 1.2629248 0.3142089 0.2593054 0.3845812 0.0427978 0.158744 0.3328374 0.1625072 0.0345696 -0.4706939 -0.1159258 -0.109924 -0.0309098 -0.101816 0.0409237 -0.0107189 0.0449938 -0.0842854 2.4107012 -0.0908137 0.2871161 -0.2606954 0.6325713 0.5411095 0.2651658 0.5201852 1.0033644 0.0828725 -0.0092473 -0.0022918 0.0396161 0.0721359 -0.1318084 0.0491492 -0.1289357 0.0462521 -0.1725817 -0.0240829 0.0250162 -0.0794124 0.0420223 0.0533188 -0.0726673 0.033295 -0.184986 -0.1268801 0.0449756 -0.0205706 -0.0434419 -0.1832535 -0.0798823 -0.0711981 -0.0482555 0.0263677 0.0824482 -0.003299 0.0019294 -0.0288443 0.0694041 -0.1058121 -0.0257255 -0.1068294 0.0504451 0.0616134 -0.0425998 -0.0394884 -0.0029609 0.0569627 -0.1143255 0.0034868 -0.1125638 0.038188 -0.0227019 0.0495292 0.0663043 0.0386808 0.1174017 -0.060439 0.0562177 -0.0610652 0.09914 0.1984204 0.0212979 0.0524012 0.0049005 0.2781306 -0.1095134 0.0872633 -0.0659106 0.2922343 0.1638964 -0.048041 0.0633661 -0.1911304 0.2832315 -0.1296573 0.1252101 -0.041681 0.2430363 0.1953229 0.0709991 -0.0629221 0.1725111 0.2951484 -0.0904878 -0.0718818 -0.044917 0.2153366 0.2605264 0.0336668 -0.0938439 0.0261699 0.2888422 -0.0792157 -0.1300649 -0.0753167 0.2083388 unknown
polarizability: 301.7917445|11.1192465|102.5241785|9.063187|42.3256461|116.2393639 unknown
InChI: InChI=1S/C10H10BrN3S/c11-7-1-2-9-6(3-7)4-8(15-9)5-14-10(12)13/h1-4H,5,12-13H2
charge 0 multiplicity 1
25 atoms
Br 5.70468 0.799626 0.658199
S  -0.43834 -0.946989 -0.847985
N  -3.167336 -0.336724 -0.1861
N  -5.207099 -0.676289 -1.286979
N  -5.226791 0.623138 0.669519
C  1.479568 0.388483 0.496474
C  1.313131 -0.574686 -0.551486
C  -0.886887 0.221356 0.473022
C  0.212113 0.818162 1.055047
C  -2.352775 0.385764 0.803433
C  2.79213 0.800367 0.858162
C  2.418441 -1.122503 -1.232355
C  3.878596 0.242016 0.169529
C  3.719297 -0.711238 -0.868412
C  -4.463731 -0.130866 -0.233775
H  0.133019 1.549747 1.864121
H  -2.51751 -0.012236 1.833337
H  -2.584952 1.47775 0.845009
H  2.944708 1.534485 1.65469
H  2.286314 -1.857411 -2.032947
H  4.593333 -1.122671 -1.380265
H  -4.658925 -1.163215 -1.99425
H  -6.161799 -0.991633 -1.123928
H  -6.123546 1.014062 0.390358
H  -4.809338 0.951907 1.534782
