program: Gaussian 09
title: 000211389
version: EM64L-G09RevD.01
frameworkgroup: C1[X(C10H10ClN3S)]
method: RPBEPBE
basis: SDD
operation: Freq
keyword: #p
keyword: freq=noraman
keyword: PBEPBE/SDD
title: #p freq=noraman PBEPBE/SDD
converged: YES YES NO NO
title: Mulliken charges:
elementType: Cl S N N N C C C C C C C C C C H H H H H H H H H H
charge: -0.071414 0.264043 -0.113527 -0.634053 -0.652888 0.639993 -0.425094 -0.067398 -0.445659 -0.566302 -0.400985 -0.248704 -0.088367 -0.230026 0.250141 0.270123 0.209128 0.253025 0.266992 0.249535 0.257748 0.325609 0.295564 0.309339 0.353175
chargesum: 0.00000
title: Mulliken charges with hydrogens summed into heavy atoms:
elementType: Cl S N N N C C C C C C C C C C
charge: -0.071414 0.264043 -0.113527 -0.012879 0.009626 0.639993 -0.425094 -0.067398 -0.175535 -0.104149 -0.133993 0.000831 -0.088367 0.027722 0.250141
polarizability: 2.47835342e+02 -1.04453433e+01 1.34246265e+02 -1.09296694e+01 -1.03226043e+01 1.01233960e+02
1716.lowfreq: -2.9599 -0.0015 -0.0011 -0.0002 4.0079 5.8591 26.2838 42.6216 61.5858
frequency: 25.9845 42.5960 61.5474 97.4446 128.8211 161.0153 225.7472 240.5910 279.0563 295.1145 306.9429 327.6529 355.5056 409.6937 416.6982 426.7636 455.5791 471.6948 491.6590 526.9819 540.5930 564.0050 588.2489 601.8826 624.5956 681.1686 688.6246 714.8175 730.6302 802.1706 828.5318 854.8913 882.9715 891.6866 943.5636 978.2198 1004.8068 1033.7905 1037.3479 1062.7633 1107.6542 1142.2997 1155.4122 1189.7185 1236.2353 1250.2910 1279.3799 1329.7235 1384.6800 1413.9468 1421.7162 1440.2283 1450.6204 1541.7418 1576.1762 1593.4756 1597.8838 1605.3612 1649.7374 2907.6557 3009.4277 3150.5968 3159.3309 3162.4952 3177.7046 3528.3120 3536.3876 3677.7643 3682.1750
redmass: 7.2537 5.0765 4.1164 7.3148 6.9435 6.7818 6.5158 4.2184 4.7058 3.5295 7.5367 6.2254 1.2036 1.2238 3.9621 3.1218 1.7714 3.3907 1.4200 3.6295 9.1792 1.2659 3.7119 5.9370 5.1312 5.6427 5.7124 6.8863 3.6563 1.3432 1.5803 3.0315 4.0869 1.6927 1.3402 2.1585 2.3302 1.5224 5.0539 2.0311 3.3118 1.3594 1.5517 1.7606 1.6874 1.5531 1.6750 1.2370 7.1457 3.4134 3.8779 3.3044 1.1158 7.0291 7.4052 7.3097 1.3846 1.3281 2.6208 1.0682 1.0902 1.0895 1.0944 1.0930 1.0964 1.0448 1.0449 1.1024 1.1049
irintensity: 1.1182 2.7915 3.1525 1.2991 1.8037 3.1894 19.5720 7.2266 2.4949 4.9907 5.8099 2.9125 97.5955 180.7549 20.5539 2.3552 62.2393 21.7917 9.3196 29.0850 9.4569 260.8886 2.9201 8.4859 17.1848 38.7249 37.0124 16.2228 1.6517 43.0764 11.6271 2.5693 49.6298 39.0549 0.1881 3.3177 6.5265 8.4823 13.4892 42.1828 23.2431 10.0331 3.9351 10.8811 19.9700 3.9289 1.1265 38.8149 6.2307 13.0656 150.5000 47.8898 9.6026 2.0209 21.6087 20.6358 104.6053 104.1612 566.6559 61.1187 16.3966 2.8061 4.9457 1.9022 3.4144 42.9326 16.4614 28.8708 58.9574
temp: 298.150 k
press: 1.00000 atm
elementType: 17 16 7 7 7 6 6 6 6 6 6 6 6 6 6 1 1 1 1 1 1 1 1 1 1
symmnumber: 1
zpe: 485447.8 jmol-1
zpe.correction: 0.184897 hartree
zpe.thermalcorrener: 0.199211 hartree
zpe.thermalcorrenthalpy: 0.200155 hartree
zpe.thermalcorrgfe: 0.142380 hartree
zpe.sumelectzpe: -1408.363976 hartree
zpe.sumelectthermal: -1408.349662 hartree
zpe.sumelectthermalent: -1408.348718 hartree
zpe.sumelectthermalfe: -1408.406493 hartree
dipole: -2.3755 -1.5463 -2.4758
dipole: 3.7634
quadrupole: -107.0078 -93.7968 -96.8497
quadrupole: 8.0451 11.7495 -2.8290
quadrupole: -7.7897 5.4213 2.3684 8.0451 11.7495 -2.8290
hfenergy: -1408.5488729 hartree
pointgroup: C01 [X(C10H10Cl1N3S1)]
dipole: -1.1237486 -0.8268783 0.4957783 debye
dipolederiv: -0.7235937 0.1582118 -0.2892509 0.1573792 -0.1243166 0.052001 -0.3781791 0.074767 -0.3028686 -0.1172061 0.1564195 0.0062067 0.1738745 -0.013011 -0.1150997 -0.003426 -0.0720528 -0.2009675 -1.0009413 -0.2042914 0.0212705 -0.6245146 -0.9275538 0.139845 0.3972988 0.2343788 -0.4456142 -1.4923462 -0.3307618 -0.0315653 -0.4613526 -0.3821666 -0.143528 0.0651041 -0.1293131 -0.565131 -0.4383242 0.1989848 -0.1921202 0.0068468 -0.7829896 0.0968706 0.0156796 0.1543416 -0.8636434 0.2145112 -0.0516214 0.0365684 -0.1108113 0.1063104 -0.0823848 -0.2415067 0.0097083 -0.1096603 0.3211059 -0.1324089 0.2036784 -0.0757022 -0.1138945 -0.0572725 0.407425 -0.1348096 -0.0600584 0.0338793 -0.1647834 -0.0466422 -0.3422968 -0.0890268 0.2144143 -0.0267884 0.1093163 0.4897804 -0.4001783 -0.0174644 -0.115507 0.032577 -0.1569249 0.1062231 -0.0945164 0.0877431 -0.1759311 0.5227951 0.1901487 -0.0288184 0.3065163 0.3929402 -0.0140479 -0.0611461 0.0995937 0.1515519 -0.285549 0.0253114 -0.0908254 0.034288 -0.1157945 0.0786884 -0.0882014 0.071298 -0.0406357 0.0096053 -0.0513832 -0.0179189 -0.1007447 -0.0504406 0.066598 -0.1340814 0.0994109 0.0719997 0.9703707 -0.2667785 0.4881322 -0.2546773 0.0208047 -0.067263 0.605876 -0.0908271 0.3700027 -0.3367555 0.0238903 -0.1057699 0.0573856 -0.1297285 0.0630993 -0.0972027 0.0561011 -0.0854391 1.416538 0.4332235 0.3813003 1.1599462 1.1096022 -0.3559915 0.0896698 -0.4683944 0.9296062 0.0944418 0.0385518 -0.0137156 0.0604199 0.1341263 -0.070846 0.0470197 -0.0880318 -0.0237564 -0.0832215 -0.0384484 -0.000785 -0.0349574 0.0399084 -0.0287837 -0.0304988 -0.1806664 -0.1595485 -0.0445494 0.0065391 0.0015338 -0.0317929 -0.0923314 0.0402363 0.0025746 0.1046612 0.0536171 0.0979737 0.0315801 -0.0051567 0.0226819 0.1386194 -0.0608553 -0.0319679 -0.0513436 -0.0134032 0.089447 0.0164964 -0.0510044 0.0314285 0.1302041 -0.0460508 -0.0021833 -0.0642679 -0.0419006 0.0093928 0.0829887 0.0410526 0.0801472 0.1207647 -0.0482919 0.0230322 -0.0413452 0.0843795 0.3721596 -0.0373157 -0.0375218 -0.0368263 0.1811198 0.0613661 -0.0917908 0.0519201 0.2261075 0.3305449 0.0493734 -0.067765 -0.0479724 0.0837983 0.0296213 -0.2041607 -0.0261947 0.2699575 0.1547656 -0.0763602 -0.005703 -0.063899 0.2740905 0.0873077 -0.0418494 0.1432029 0.218334 0.2851344 -0.040102 -0.0796734 0.0620564 0.2458897 0.054144 -0.1261807 0.0508035 0.2232214 unknown
polarizability: 237.7384941|-29.9310136|107.0194142|25.7747634|5.982881|138.5576589 unknown
InChI: InChI=1S/C10H10ClN3S/c11-7-1-2-9-6(3-7)4-8(15-9)5-14-10(12)13/h1-4H,5,12-13H2
charge 0 multiplicity 1
25 atoms
Cl 4.825963 -0.979862 1.529202
S  -0.586881 0.349065 -1.639178
N  -3.550295 1.061213 -0.661512
N  -5.176803 -0.620542 -0.575269
N  -3.460343 -0.690779 1.027492
C  1.078125 0.333127 0.47639
C  1.001535 -0.09907 -0.887508
C  -1.101493 1.122559 -0.065879
C  -0.128232 1.01553 0.908811
C  -2.454548 1.800259 0.004415
C  2.25712 0.061559 1.223155
C  2.061525 -0.78986 -1.508117
C  3.300124 -0.623657 0.585857
C  3.229425 -1.055617 -0.761063
C  -4.004321 -0.035767 -0.083248
H  -0.252735 1.430611 1.913294
H  -2.663106 2.000362 1.082015
H  -2.389671 2.784165 -0.498489
H  2.347715 0.3816 2.265175
H  1.995457 -1.117249 -2.550314
H  4.071476 -1.586383 -1.213387
H  -5.629682 -0.10528 -1.328352
H  -5.28802 -1.632919 -0.554711
H  -4.018168 -1.333476 1.584351
H  -2.492668 -0.519193 1.290871
