program: Gaussian 09
title: 000211387
version: EM64L-G09RevD.01
frameworkgroup: C1[X(C14H17NO5)]
method: RPBEPBE
basis: SDD
operation: Freq
keyword: #p
keyword: freq=noraman
keyword: PBEPBE/SDD
title: #p freq=noraman PBEPBE/SDD
converged: YES YES NO NO
title: Mulliken charges:
elementType: O O O O O N C C C C C C C C C C C C C C H H H H H H H H H H H H H H H H H
charge: -0.269312 -0.280839 -0.268342 -0.242862 -0.196213 -0.207087 0.296250 -0.350713 -0.686961 0.114078 0.223422 -0.718248 0.273642 -0.378526 -0.365105 -0.181120 0.305407 -0.609865 0.221937 -0.759206 0.207753 0.206096 0.227183 0.226446 0.244228 0.229811 0.279461 0.213846 0.251369 0.264922 0.230519 0.235096 0.238292 0.279573 0.239689 0.267139 0.238238
chargesum: 0.00000
title: Mulliken charges with hydrogens summed into heavy atoms:
elementType: O O O O O N C C C C C C C C C C C C C C
charge: -0.269312 -0.280839 -0.268342 -0.242862 -0.196213 -0.207087 0.296250 0.063136 0.010895 0.114078 0.223422 0.004871 0.273642 -0.127157 -0.100183 0.049400 0.305407 0.143097 0.221937 -0.014141
polarizability: 2.11443066e+02 2.16473682e+00 1.95604262e+02 5.01247210e+00 -7.04431866e+00 1.21389100e+02
1716.lowfreq: -10.7241 -0.0007 -0.0006 -0.0004 1.2053 3.4973 14.4740 33.5457 45.0216
frequency: 12.6176 33.4225 44.9337 49.6111 58.9485 85.0718 93.9735 105.4454 134.8847 151.6222 185.2773 187.0784 202.4712 218.4528 241.7565 251.0737 267.8652 279.4433 319.2142 330.9072 336.2060 364.7560 385.2771 399.4574 478.0691 506.8851 515.6244 527.2390 545.7432 552.4181 569.3684 591.1549 594.5492 619.4856 697.6378 704.9083 707.6479 722.1286 743.6150 751.9532 784.7475 801.4103 829.5135 876.7914 895.6270 918.8871 948.2974 976.9970 998.3496 1000.8560 1023.4596 1031.1312 1045.2743 1061.0197 1099.0016 1104.7716 1119.6486 1124.4565 1162.7728 1175.7299 1183.7455 1218.8833 1226.5384 1240.3075 1257.5827 1272.9571 1285.5642 1344.8584 1378.5382 1388.2051 1397.6908 1406.8083 1427.0642 1440.7396 1447.8285 1452.6263 1459.8369 1461.9587 1465.0968 1468.6391 1477.7803 1482.8118 1497.4431 1499.1267 1613.5302 1619.3321 1637.1054 1643.5648 2991.7135 2994.3366 2995.1216 3000.6589 3004.7170 3048.1502 3081.9682 3086.9917 3088.5378 3101.5518 3107.9720 3114.3619 3132.5871 3134.6838 3152.2392 3176.4635 3186.8001
redmass: 4.3639 4.0246 4.5034 3.4825 3.6883 2.6816 1.5359 3.4523 3.6422 3.7297 1.2458 1.2274 2.8111 2.3287 4.2053 1.6858 2.2987 4.2753 4.6019 4.0092 3.3632 3.3761 3.5871 4.8510 3.9525 5.2471 4.8470 4.3174 4.0586 4.5727 3.1982 5.8727 4.7657 5.8136 6.7977 6.8993 6.9008 3.7134 3.6092 2.7474 2.6437 1.4565 5.2372 1.3853 2.0217 3.9653 1.3036 2.4197 1.3714 2.0920 1.5293 1.6995 1.8781 3.4123 3.9488 2.5508 1.6600 1.7533 1.2791 3.1314 3.4067 2.5163 2.2112 4.0554 3.3346 1.2330 3.6760 1.7668 1.2346 1.2581 1.2027 4.3827 1.1495 1.0805 1.0844 3.0649 1.1252 1.0522 1.0501 4.0003 1.0573 1.0411 1.0471 1.0543 9.5490 8.7933 9.5627 9.4415 1.0435 1.0509 1.0376 1.0350 1.0366 1.1009 1.0977 1.0994 1.1030 1.1016 1.0998 1.1008 1.0991 1.0992 1.0874 1.0930 1.0986
irintensity: 0.2871 1.2119 8.0926 0.9508 0.2321 2.0157 1.9877 0.8321 1.7359 2.4164 0.4770 0.3829 2.1352 0.5588 0.0636 0.2296 1.1467 0.9176 5.1480 0.0671 3.6397 1.4110 17.7706 1.3344 0.0985 10.6191 0.8241 6.0696 4.0272 1.1785 3.7123 8.7323 13.9023 2.0299 3.9759 1.6485 27.8704 20.0144 31.3143 35.2870 44.7310 20.1240 9.2345 0.6013 37.2737 10.5814 2.2431 143.0064 34.2187 16.8488 27.8205 6.1567 27.9873 54.6563 127.4129 516.9127 5.6564 70.3469 41.5077 70.8377 16.3925 82.7503 141.5835 94.5824 138.9698 4.0874 410.4947 16.6137 61.2972 26.0641 16.5972 41.1801 67.5647 3.0217 19.0404 43.0272 4.6490 11.4925 11.8292 127.9322 23.7043 12.6211 33.1558 21.1440 6.4617 68.5391 204.2286 225.2326 30.4431 20.8177 1.2128 54.1500 15.9407 10.2340 10.8067 33.1216 24.0737 6.3531 16.8683 19.4500 2.6970 6.8912 8.5690 2.8881 5.6599
temp: 298.150 k
press: 1.00000 atm
elementType: 8 8 8 8 8 7 6 6 6 6 6 6 6 6 6 6 6 6 6 6 1 1 1 1 1 1 1 1 1 1 1 1 1 1 1 1 1
symmnumber: 1
zpe: 757487.1 jmol-1
zpe.correction: 0.288512 hartree
zpe.thermalcorrener: 0.309029 hartree
zpe.thermalcorrenthalpy: 0.309973 hartree
zpe.thermalcorrgfe: 0.237530 hartree
zpe.sumelectzpe: -973.057640 hartree
zpe.sumelectthermal: -973.037123 hartree
zpe.sumelectthermalent: -973.036179 hartree
zpe.sumelectthermalfe: -973.108622 hartree
dipole: 0.8464 -3.7938 0.6274
dipole: 3.9374
quadrupole: -98.9295 -107.9543 -119.0382
quadrupole: -12.0048 -2.6796 -5.7451
quadrupole: 9.7112 0.6864 -10.3975 -12.0048 -2.6796 -5.7451
hfenergy: -973.3461516 hartree
pointgroup: C01 [X(C14H17N1O5)]
dipole: 0.4309093 -1.4837377 -0.1116854 debye
polarizability: 211.1080214|1.8123467|194.8093272|5.9215709|11.3684456|122.5190791 unknown
InChI: InChI=1S/C14H17NO5/c1-5-14(3)19-11-8-6-7-10(12(11)20-14)18-13(17)15(4)9(2)16/h6-8H,5H2,1-4H3
charge 0 multiplicity 1
37 atoms
O  -1.128733 -1.044245 0.398984
O  -3.387067 -0.212909 0.25978
O  1.291359 0.784809 0.382105
O  1.107977 -0.453943 -1.601004
O  3.822972 1.476527 0.860537
N  3.127213 -0.419645 -0.383493
C  -2.57883 -1.49159 0.320955
C  -2.785638 -2.289783 -0.972088
C  -2.922861 -2.223112 1.612526
C  -1.144374 0.354365 0.305486
C  -2.463762 0.854223 0.247755
C  -2.368822 -1.535416 -2.250773
C  -0.058701 1.235716 0.275648
C  -2.747111 2.22188 0.198861
C  -0.307468 2.628897 0.233226
C  -1.634804 3.109799 0.198204
C  1.780719 -0.044391 -0.629647
C  3.615582 -1.583164 -1.16995
C  4.04219 0.311875 0.452645
C  5.331554 -0.431131 0.794702
H  -3.855526 -2.57185 -1.016023
H  -2.205105 -3.227582 -0.875199
H  -3.982637 -2.530072 1.601313
H  -2.291274 -3.121796 1.715915
H  -2.75201 -1.565533 2.480334
H  -2.966781 -0.616471 -2.379679
H  -1.300984 -1.258917 -2.217901
H  -2.534449 -2.173708 -3.136918
H  -3.776487 2.586627 0.162065
H  0.548634 3.308998 0.230999
H  -1.812041 4.189128 0.165129
H  3.967163 -2.38595 -0.500406
H  4.433088 -1.288532 -1.850426
H  2.778152 -1.957002 -1.775906
H  5.947409 -0.623952 -0.102271
H  5.905429 0.202819 1.485904
H  5.125526 -1.403668 1.276812
