program: Gaussian 09
title: 000211386
version: EM64L-G09RevD.01
frameworkgroup: C1[X(C11H16N2O3S)]
method: RPBEPBE
basis: SDD
operation: Freq
keyword: #p
keyword: freq=noraman
keyword: PBEPBE/SDD
title: #p freq=noraman PBEPBE/SDD
converged: YES YES NO NO
title: Mulliken charges:
elementType: S O O O N N C C C C C C C C C C C H H H H H H H H H H H H H H H H
charge: 0.996229 -0.485213 -0.549102 -0.302351 -0.678699 -0.383970 -0.027975 -0.338525 -0.336889 -0.309504 0.446309 -0.286219 0.399050 -0.406501 -0.194150 -0.675406 -0.799335 0.211703 0.252473 0.222528 0.186327 0.303876 0.336680 0.293097 0.289986 0.238624 0.239644 0.218323 0.222369 0.207608 0.242242 0.222655 0.244119
chargesum: 0.00000
title: Mulliken charges with hydrogens summed into heavy atoms:
elementType: S O O O N N C C C C C C C C C C C
charge: 0.996229 -0.485213 -0.549102 -0.302351 -0.342019 -0.093984 -0.027975 0.125651 0.071966 -0.005628 0.446309 0.006878 0.399050 -0.167877 0.045495 -0.027107 -0.090319
polarizability: 1.86871908e+02 1.20335855e+01 1.78194548e+02 -1.49979573e+01 1.25335153e+01 1.43634836e+02
1716.lowfreq: -11.8182 -4.4934 -3.6064 -0.0022 -0.0006 0.0008 14.8937 21.7450 41.0428
frequency: 14.4915 21.5867 40.9952 41.5336 50.9554 67.5841 85.2412 111.9020 124.0164 129.5058 202.5513 208.4245 218.8457 219.3246 239.1489 247.1897 264.9078 294.8860 310.9333 317.3385 378.9500 397.4240 427.7819 435.5646 491.5793 511.9686 516.5349 543.0885 649.6509 659.8463 681.7819 702.7667 715.9962 752.0926 793.4494 799.3326 829.9296 864.1524 878.3232 888.6873 929.1888 951.3848 961.7626 977.8983 990.7887 992.8117 1042.9269 1051.7067 1063.7613 1093.3855 1094.7513 1110.7086 1145.6116 1175.1082 1180.5737 1220.7208 1245.3570 1297.8448 1299.3877 1302.7578 1330.0104 1366.7610 1372.8189 1391.6108 1400.1837 1421.6907 1456.3341 1467.6727 1470.7446 1474.3564 1477.0583 1477.1878 1486.2895 1490.4734 1568.0345 1615.6052 1617.1558 2977.5136 2979.8376 2983.8759 2990.6974 3036.3108 3066.0559 3069.9562 3081.1111 3082.9047 3092.2742 3131.6407 3153.7806 3168.9325 3172.5666 3492.8033 3555.7675
redmass: 4.1572 3.3289 1.1772 2.9168 4.0757 2.7433 2.7869 5.7226 6.1107 6.2448 3.8130 5.1947 1.2139 3.8526 5.6654 6.9667 2.6773 4.3089 1.8332 2.4739 4.3431 3.8802 7.2924 3.0337 3.9731 5.0022 1.3769 4.5489 6.4613 3.9463 2.3223 9.3772 4.3299 1.1887 2.0213 2.5868 8.1121 1.4538 1.3884 1.7144 1.3459 4.4990 5.4343 4.2491 1.3510 1.6236 3.2425 1.5667 2.3436 1.7711 2.2610 2.1810 1.6491 1.1312 1.8681 2.2937 1.2628 1.2796 1.1459 1.2560 1.8346 1.4099 4.8496 1.2091 1.2553 2.6775 1.1034 1.0811 2.1977 1.0724 1.0787 1.1716 1.1890 1.4454 5.6547 6.8854 6.8044 1.0386 1.0595 1.0375 1.0664 1.0965 1.0969 1.0990 1.1000 1.1007 1.0997 1.0884 1.0917 1.0932 1.0981 1.0787 1.0775
irintensity: 0.4073 0.5088 1.0644 1.2012 2.4418 4.2485 3.1447 5.0052 2.5248 3.0455 1.4476 1.0045 1.2528 5.6545 2.1430 3.9892 2.5667 4.8333 9.8489 25.0867 33.0870 4.4797 48.1562 19.4865 85.8461 3.2700 193.0503 23.1919 1.2652 33.6297 25.3316 58.5462 112.8735 14.3942 91.9629 15.8212 57.5341 0.5783 4.1412 19.1772 3.5607 32.7551 55.3288 0.8377 0.0949 8.1542 7.2282 14.7870 12.1248 5.6788 51.7838 3.4906 2.7912 7.6780 135.5032 0.6194 22.3468 3.7074 20.0523 0.6241 305.4937 16.5546 3.9589 7.2171 18.6889 5.1004 31.4839 16.1812 26.2858 4.4118 63.4489 16.7219 93.7380 235.2423 3.8867 73.5723 92.3180 38.9372 18.2832 22.0838 60.0229 9.6311 14.2572 23.0979 41.5725 45.4527 17.2324 11.3168 10.3642 1.5815 18.9231 27.1471 24.8444
temp: 298.150 k
press: 1.00000 atm
elementType: 16 8 8 8 7 7 6 6 6 6 6 6 6 6 6 6 6 1 1 1 1 1 1 1 1 1 1 1 1 1 1 1 1
symmnumber: 1
zpe: 676959.0 jmol-1
zpe.correction: 0.257840 hartree
zpe.thermalcorrener: 0.277315 hartree
zpe.thermalcorrenthalpy: 0.278260 hartree
zpe.thermalcorrgfe: 0.206645 hartree
zpe.sumelectzpe: -1160.556497 hartree
zpe.sumelectthermal: -1160.537021 hartree
zpe.sumelectthermalent: -1160.536077 hartree
zpe.sumelectthermalfe: -1160.607691 hartree
dipole: -2.8338 3.5789 -3.6795
dipole: 5.8633
quadrupole: -89.4136 -110.3765 -111.3979
quadrupole: 18.8768 -0.3330 6.8005
quadrupole: 14.3157 -6.6472 -7.6685 18.8768 -0.3330 6.8005
hfenergy: -1160.8143367 hartree
pointgroup: C01 [X(C11H16N2O3S1)]
dipole: -0.9782244 -1.6397058 1.2944862 debye
polarizability: 189.2343937|-12.4242438|172.9869491|10.7897591|17.7054455|146.4799496 unknown
InChI: InChI=1S/C11H16N2O3S/c1-3-7-12-11(14)13-17(15,16)10-6-4-5-9(2)8-10/h4-6,8,12-13H,3,7H2,1-2H3
charge 0 multiplicity 1
33 atoms
S  0.904059 1.988564 -0.045103
O  0.819379 2.373847 -1.611362
O  1.416858 3.073635 1.054668
O  -1.262986 -0.079342 -0.901564
N  -0.776841 1.622009 0.631705
N  -2.97536 0.814846 0.428093
C  1.868149 0.379924 0.179432
C  -4.005992 -0.121273 -0.054428
C  -4.357198 -1.231081 0.964063
C  1.779599 -0.594658 -0.821109
C  2.546888 -1.779869 -0.665386
C  2.6645 0.285208 1.331471
C  -1.662173 0.734458 -0.015484
C  3.357818 -1.912723 0.491909
C  3.421666 -0.898684 1.476574
C  -5.447682 -2.176961 0.416896
C  2.490052 -2.865949 -1.723355
H  -4.916155 0.453034 -0.31781
H  -3.611326 -0.572208 -0.981356
H  -3.438346 -1.801527 1.19728
H  -4.701107 -0.771705 1.912938
H  1.120125 -0.446764 -1.681287
H  -1.066344 2.359587 1.285395
H  2.699247 1.101515 2.059302
H  -3.230064 1.485454 1.154191
H  3.952316 -2.824621 0.622453
H  4.062187 -1.026827 2.355286
H  -5.114339 -2.668303 -0.516017
H  -5.690549 -2.969064 1.147363
H  -6.381229 -1.62653 0.193446
H  2.964698 -2.528563 -2.663957
H  3.010798 -3.780678 -1.392891
H  1.445351 -3.13225 -1.964555
