program: Gaussian 09
title: 000211374
version: EM64L-G09RevD.01
frameworkgroup: C1[X(C11H16NO4PS)]
method: RPBEPBE
basis: SDD
operation: Freq
keyword: #p
keyword: freq=noraman
keyword: PBEPBE/SDD
title: #p freq=noraman PBEPBE/SDD
converged: YES YES NO NO
title: Mulliken charges:
elementType: S P O O O O N C C C C C C C C C C C H H H H H H H H H H H H H H H H
charge: -0.239051 0.879102 -0.510074 -0.459488 -0.470956 -0.414197 -0.073997 0.370642 -0.444111 -0.214443 -0.248550 0.473147 -0.371092 -0.411308 -0.188279 -0.654591 -0.643926 -0.315231 0.232078 0.226932 0.235420 0.228713 0.299242 0.256228 0.233195 0.233471 0.209842 0.233409 0.237647 0.213429 0.239626 0.245777 0.241296 0.370097
chargesum: 0.00000
title: Mulliken charges with hydrogens summed into heavy atoms:
elementType: S P O O O O N C C C C C C C C C C C
charge: -0.239051 0.879102 -0.510074 -0.459488 -0.470956 -0.044100 -0.073997 0.370642 -0.144869 0.244567 0.215584 0.473147 -0.114864 -0.178113 0.045192 0.026307 0.054906 -0.073935
polarizability: 2.41178094e+02 2.18704326e+01 2.02991778e+02 3.09909848e+00 1.95993845e+01 1.37995266e+02
1716.lowfreq: -11.4642 -5.9446 -0.0018 -0.0014 -0.0006 4.9946 14.6073 27.4939 35.1173
frequency: 13.8241 27.3899 34.7530 44.4422 49.2534 54.7357 70.5600 98.7601 107.1944 121.5889 141.6280 157.4515 181.3851 202.8774 216.0630 242.6677 248.4141 273.1618 289.9805 303.8409 330.4873 354.3007 378.9603 397.7492 415.2702 430.5848 433.8506 460.4358 489.9564 543.9045 606.8634 625.9198 668.2345 674.7565 694.2155 707.9668 786.9003 794.1232 800.9245 812.6931 865.7380 880.4419 903.5540 905.5973 933.0306 958.1646 969.1041 982.3049 987.1370 1005.1839 1021.2126 1083.0271 1093.6386 1106.5554 1133.7074 1135.6218 1139.4186 1174.7623 1219.0202 1233.7799 1256.5301 1269.4636 1290.6428 1354.6025 1356.2024 1381.5670 1393.8998 1395.2807 1395.3993 1430.3351 1457.6350 1460.3588 1464.1587 1473.7654 1477.4159 1482.9049 1487.2709 1566.5674 1592.9282 1607.9320 2986.3646 2990.1580 2997.4698 3006.7753 3057.7428 3067.0076 3079.0992 3083.7362 3093.9580 3107.9848 3112.6109 3131.4167 3153.8901 3177.4891 3182.8737 3567.3680
redmass: 5.2402 3.4366 3.7406 2.9599 3.5442 2.7658 4.9982 3.7866 4.9519 5.0787 5.1741 4.0870 6.0711 5.3622 2.0111 1.7732 1.8673 1.9462 4.4309 4.3260 5.7539 7.6630 5.7004 4.8213 4.2458 2.1972 1.6533 3.4655 5.2649 8.1212 5.2309 6.4579 9.0826 6.8815 2.0825 6.8955 5.8732 1.1706 1.5156 1.0912 4.4571 4.0325 1.6382 4.6564 1.3986 1.5343 2.9381 1.3806 5.8971 2.5508 2.6844 1.6308 2.2033 2.2294 1.4296 1.8938 1.6082 1.1259 1.4023 1.8059 1.1434 1.1143 1.3210 1.2106 1.2462 2.8535 2.4744 1.2404 1.2429 3.1252 1.0397 1.0782 1.0422 2.6755 1.0554 1.0591 1.0773 6.0712 6.4786 6.4171 1.0363 1.0543 1.0385 1.0618 1.1079 1.0899 1.1017 1.0985 1.0981 1.1039 1.1023 1.0879 1.0929 1.0972 1.0929 1.0675
irintensity: 0.1416 0.8439 0.7559 3.8175 1.0355 0.5161 1.2659 0.0611 2.3245 0.6639 0.7742 3.0811 0.8670 9.3868 3.5344 0.3364 1.6655 8.3880 3.5104 1.2698 6.7836 1.1725 14.7077 7.0376 6.5997 48.2123 128.4668 6.3754 8.5422 33.1038 12.7614 41.1059 87.1175 83.2262 25.9209 110.2615 189.5250 15.0968 46.8004 3.5352 216.2501 132.4203 29.7650 129.9183 11.1339 37.9773 64.8636 4.3031 0.1864 158.6192 64.3387 8.5838 6.6820 6.4688 9.7847 54.4368 17.5002 3.6350 151.5239 45.7492 0.1564 0.2544 6.2639 11.2953 5.8890 5.3530 8.9059 12.1631 33.9079 74.2887 12.7091 4.6812 13.9214 21.9079 6.7739 22.8919 11.0688 28.6257 20.2422 29.6211 12.9488 20.5388 26.2749 32.8701 11.9480 16.2576 8.4264 25.0794 25.1507 21.1938 31.6224 6.3417 19.7674 5.5027 2.4242 80.4101
temp: 298.150 k
press: 1.00000 atm
elementType: 16 15 8 8 8 8 7 6 6 6 6 6 6 6 6 6 6 6 1 1 1 1 1 1 1 1 1 1 1 1 1 1 1 1
symmnumber: 1
zpe: 678341.7 jmol-1
zpe.correction: 0.258367 hartree
zpe.thermalcorrener: 0.279420 hartree
zpe.thermalcorrenthalpy: 0.280365 hartree
zpe.thermalcorrgfe: 0.205074 hartree
zpe.sumelectzpe: -1522.269319 hartree
zpe.sumelectthermal: -1522.248265 hartree
zpe.sumelectthermalent: -1522.247321 hartree
zpe.sumelectthermalfe: -1522.322611 hartree
dipole: -0.1481 -0.0139 -0.0668
dipole: 0.1631
quadrupole: -108.9396 -100.9387 -130.5944
quadrupole: 4.0373 -4.4573 2.4495
quadrupole: 4.5513 12.5522 -17.1035 4.0373 -4.4573 2.4495
hfenergy: -1522.5276854 hartree
pointgroup: C01 [X(C11H16N1O4P1S1)]
dipole: -0.0533857 0.0140774 0.0326883 debye
polarizability: 231.0908329|-24.6245582|209.051634|-10.2520256|27.0221849|142.0226712 unknown
InChI: InChI=1S/C11H16NO4PS/c1-3-14-17(18,15-4-2)16-11-7-5-6-10(8-11)9-12-13/h5-9,13H,3-4H2,1-2H3
charge 0 multiplicity 1
34 atoms
S  2.213298 0.152715 -2.37069
P  2.138567 0.136015 -0.307121
O  1.144648 -1.09289 0.459232
O  3.588332 -0.175419 0.557622
O  1.617608 1.562353 0.497312
O  -4.253917 2.701297 1.522158
N  -3.091393 1.862703 1.232261
C  -0.250573 -1.200968 0.202381
C  -1.129458 -0.177866 0.598638
C  4.383376 -1.390128 0.187398
C  1.559523 2.867771 -0.239342
C  -2.526604 -0.344505 0.393555
C  -0.718069 -2.401294 -0.38099
C  -3.008337 -1.552201 -0.183126
C  -2.107805 -2.571245 -0.561778
C  5.676879 -1.304271 0.990165
C  0.137176 3.150069 -0.722984
C  -3.49333 0.697999 0.766737
H  3.790931 -2.285698 0.450644
H  4.567963 -1.376458 -0.904282
H  1.897692 3.595083 0.517209
H  2.277888 2.849157 -1.080835
H  -0.742749 0.730012 1.069179
H  -0.00056 -3.172683 -0.675154
H  -4.085403 -1.68764 -0.336178
H  -2.486476 -3.497681 -1.005955
H  6.310155 -2.183512 0.769719
H  6.239376 -0.391975 0.729642
H  5.463263 -1.288626 2.07199
H  0.094017 4.164707 -1.162931
H  -0.166057 2.425596 -1.498578
H  -0.586683 3.09999 0.108799
H  -4.567403 0.484319 0.641592
H  -3.843274 3.533676 1.871416
