program: Gaussian 09
title: 000216632
version: EM64L-G09RevD.01
frameworkgroup: C1[X(C20H29N3O)]
method: RPBEPBE
basis: SDD
operation: Freq
keyword: #p
keyword: freq=noraman
keyword: PBEPBE/SDD
title: #p freq=noraman PBEPBE/SDD
converged: NO YES NO NO
title: Mulliken charges:
elementType: O N N N C C C C C C C C C C C C C C C C C C C C H H H H H H H H H H H H H H H H H H H H H H H H H H H H H
charge: -0.304056 -0.411356 -0.382079 -0.703393 0.400997 -0.085774 -0.092510 -0.090410 -0.536995 -0.528360 -0.504154 -0.450162 -0.451025 -0.453262 -0.387656 -0.432417 -0.384962 0.142023 0.318210 -0.554950 -0.401201 0.506325 -0.211373 -0.422527 0.196958 0.200018 0.194263 0.184200 0.213946 0.205213 0.219737 0.186804 0.205695 0.193958 0.195483 0.196949 0.190882 0.196773 0.193901 0.234699 0.227831 0.201280 0.231664 0.198562 0.253919 0.213619 0.350365 0.267126 0.217571 0.218938 0.216458 0.302913 0.311339
chargesum: 0.00000
title: Mulliken charges with hydrogens summed into heavy atoms:
elementType: O N N N C C C C C C C C C C C C C C C C C C C C
charge: -0.304056 -0.176657 -0.031714 -0.089140 0.400997 0.111185 0.107508 0.103854 -0.138848 -0.103410 -0.111655 -0.060721 -0.063194 -0.062589 0.041455 -0.002191 0.082576 0.142023 0.318210 -0.287824 -0.183630 0.506325 0.007565 -0.206069
polarizability: 2.69688845e+02 -1.36802100e+01 2.53237050e+02 2.83466512e+01 2.72802404e+00 1.76951970e+02
1716.lowfreq: -24.0152 -20.6610 -8.2185 -4.1962 -0.0003 0.0003 0.0007 11.8780 29.7963
frequency: -22.0716 10.8408 28.7882 43.5157 54.8489 64.1964 106.4820 126.7170 155.5280 170.0883 206.2999 217.7051 256.4819 264.2647 274.2818 295.1408 302.6845 338.2159 361.6795 374.2828 378.9871 382.2687 390.7842 391.9932 392.8660 419.5350 430.0052 438.0325 443.4518 470.5258 521.7770 533.5246 573.0943 628.6256 631.8924 639.6281 658.6473 677.6341 688.0231 714.9514 726.3028 743.3713 750.4793 768.5902 792.1442 801.1501 806.5803 808.5067 865.7127 867.5214 868.8145 873.8013 875.8614 897.4647 915.1486 917.0942 936.1649 943.9389 959.0500 965.4989 970.2953 975.2620 978.5082 982.3478 1003.0629 1029.1830 1036.8324 1044.2315 1047.2283 1067.0633 1084.6952 1092.4809 1097.9005 1099.0803 1102.3454 1105.5293 1111.4943 1112.2336 1140.7014 1150.4981 1177.7989 1181.6336 1182.6595 1205.6932 1209.9806 1251.6901 1256.1731 1270.7883 1274.0891 1278.9496 1286.9330 1289.0766 1298.7914 1303.7051 1308.7279 1311.4618 1324.2202 1327.1906 1333.6949 1340.7509 1342.8561 1349.2940 1352.7009 1357.2523 1359.9351 1369.2584 1398.1072 1445.0362 1449.5932 1450.0165 1451.1371 1458.0180 1461.3638 1462.4953 1463.5085 1467.7486 1477.1888 1482.1815 1494.9900 1497.1909 1573.0458 1595.2579 1628.9351 1643.1297 2910.1970 2949.7349 2957.4835 2962.7819 2963.6126 2964.9895 2968.3293 2979.0574 2992.6688 2996.2155 2997.3857 3007.5421 3017.2764 3017.9352 3018.8916 3024.6504 3026.8556 3029.1900 3031.6790 3049.3791 3083.3251 3115.1038 3130.0079 3136.9043 3151.7742 3381.5078 3447.7557 3567.9729 3709.2028
redmass: 3.5476 5.1778 4.4328 5.2729 4.2732 4.8691 3.7177 3.4307 2.5239 4.3478 2.5009 3.4350 2.3205 3.7617 2.5921 2.0065 3.9045 3.0873 1.2030 2.3254 4.1611 2.8966 1.1738 3.0831 4.2026 1.8951 2.9368 1.7915 1.8943 3.8245 3.3067 5.9582 4.4805 3.5784 3.5392 3.6925 5.3453 1.6808 2.1235 2.7796 2.8034 1.8631 1.3269 3.1090 2.1563 2.1493 2.6984 2.7271 1.5766 1.5084 1.9046 1.6212 1.9183 2.7111 2.9223 1.6297 2.0394 2.1652 1.3434 2.1843 2.1427 2.1409 2.3159 4.1983 2.4121 1.5743 1.8517 1.7339 1.7555 2.4386 2.3736 1.8766 1.3757 1.1811 1.3308 1.4612 1.2151 1.1728 3.2059 2.9682 1.1878 1.1571 1.1570 1.2467 1.2012 1.7132 1.6306 1.6530 1.2829 1.7252 1.9074 1.8069 2.0516 1.4740 1.6541 1.6130 1.3136 2.1213 1.4225 1.4400 1.4228 1.4583 1.3731 1.5613 1.5536 1.3390 7.3512 1.2577 1.2491 1.3003 1.1727 1.4900 1.0910 1.0925 1.0988 1.1274 2.5846 1.0931 1.8027 1.3106 6.8869 6.8080 3.2704 1.4118 1.0696 1.0626 1.0611 1.0633 1.0607 1.0613 1.0610 1.0633 1.0840 1.0838 1.0665 1.0845 1.1001 1.1013 1.1018 1.0928 1.1001 1.1019 1.0998 1.0976 1.0988 1.0857 1.0911 1.0912 1.0991 1.0732 1.0780 1.0448 1.1041
irintensity: 0.1446 0.2111 0.2116 4.3917 0.7101 2.1875 2.6884 2.5028 3.7722 0.5950 1.5301 5.8429 1.6052 4.3296 0.0130 0.0799 4.8111 2.6539 258.4087 3.1621 3.2930 1.4521 48.3314 4.3295 0.2872 0.8058 1.5048 0.9888 0.2064 7.3082 2.2428 2.1224 6.2465 4.3959 6.8733 1.4828 0.7863 48.2734 4.4619 2.1143 79.8048 18.5315 74.2485 4.8386 43.0721 42.2955 7.9962 2.1948 0.7693 2.2607 6.3554 1.4088 11.9574 12.1577 6.7523 25.0974 2.7047 1.5608 2.0483 2.9706 3.8064 10.2887 2.6473 4.3769 7.5301 2.8373 5.0203 0.6132 0.0232 18.3452 3.7973 13.1858 7.1480 5.0464 3.0727 8.9067 1.3309 1.1335 21.0561 9.5264 12.3728 2.5093 2.4602 3.1118 36.0511 44.3651 6.8861 14.2368 28.5264 6.5541 0.2713 2.3756 16.0579 42.5399 5.7759 2.2982 0.0989 77.5630 5.3600 1.7538 1.4033 9.8259 10.9397 0.3721 3.5312 1.2053 14.0239 23.3768 15.0347 21.5522 3.5129 2.9179 10.3667 16.3096 20.9095 6.1526 306.9376 1.0630 53.8508 74.1644 253.8158 26.3460 23.6465 262.5506 65.1378 24.4369 41.1852 22.4214 22.4440 31.3228 51.3115 46.8822 140.2207 129.0683 88.6075 36.9968 9.7005 0.3730 2.0556 37.9517 63.6902 112.4968 45.2349 55.3299 11.3771 6.4644 31.2493 9.9466 21.5514 2.6676 198.0306 71.1510 20.2093
temp: 298.150 k
press: 1.00000 atm
elementType: 8 7 7 7 6 6 6 6 6 6 6 6 6 6 6 6 6 6 6 6 6 6 6 6 1 1 1 1 1 1 1 1 1 1 1 1 1 1 1 1 1 1 1 1 1 1 1 1 1 1 1 1 1
symmnumber: 1
zpe: 1210657.4 jmol-1
zpe.correction: 0.461115 hartree
zpe.thermalcorrener: 0.482047 hartree
zpe.thermalcorrenthalpy: 0.482991 hartree
zpe.thermalcorrgfe: 0.410620 hartree
zpe.sumelectzpe: -1017.219356 hartree
zpe.sumelectthermal: -1017.198424 hartree
zpe.sumelectthermalent: -1017.197480 hartree
zpe.sumelectthermalfe: -1017.269851 hartree
dipole: -3.2589 -2.6644 0.9571
dipole: 4.3169
quadrupole: -137.1634 -137.2345 -143.7077
quadrupole: -23.7918 10.6461 -1.7498
quadrupole: 2.2052 2.1340 -4.3392 -23.7918 10.6461 -1.7498
hfenergy: -1017.6804709 hartree
pointgroup: C01 [X(C20H29N3O1)]
dipole: -1.3481302 1.0330101 -0.0037974 debye
polarizability: 262.4654239|22.6107781|250.0473173|-32.1829698|16.7016637|187.3651239 unknown
InChI: InChI=1S/C20H29N3O/c21-18-4-1-3-17(10-18)19(24)22-5-2-6-23-20-11-14-7-15(12-20)9-16(8-14)13-20/h1,3-4,10,14-16,22-23H,2,5-9,11-13,21H2
charge 0 multiplicity 1
53 atoms
O  3.588711 -2.095636 -0.966432
N  -1.448737 -1.748918 -0.064509
N  1.497095 -1.882862 0.034313
N  5.439022 2.666069 -1.099298
C  -2.410136 -0.611579 0.092533
C  -3.738621 0.656372 1.871486
C  -2.701174 1.917159 -0.066623
C  -4.696671 0.401242 -0.461125
C  -2.773939 -0.528522 1.601904
C  -1.740591 0.725868 -0.331316
C  -3.732412 -0.79021 -0.721554
C  -3.049957 1.981115 1.444615
C  -5.042715 0.463389 1.051128
C  -4.004241 1.723947 -0.889529
C  -0.954744 -2.075612 -1.42936
C  -0.004745 -3.297452 -1.408679
C  1.057126 -3.248084 -0.268454
C  2.729416 -1.386781 -0.342106
C  3.002373 0.057476 0.015556
C  4.060611 0.691064 -0.670218
C  2.263518 0.773023 0.996777
C  4.39385 2.048371 -0.410089
C  2.595826 2.120271 1.261125
C  3.640823 2.76297 0.56788
H  -3.979317 0.691986 2.952308
H  -2.202524 2.857199 -0.374047
H  -5.624011 0.258094 -1.050744
H  -3.248687 -1.481937 1.919131
H  -1.841877 -0.414534 2.189826
H  -1.477821 0.70125 -1.407228
H  -0.796196 0.857378 0.233351
H  -4.217221 -1.744936 -0.427915
H  -3.50589 -0.854436 -1.804357
H  -2.129043 2.140868 2.040806
H  -3.722747 2.839522 1.642854
H  -5.741966 1.300825 1.246989
H  -5.554394 -0.46965 1.362924
H  -4.687836 2.580516 -0.724222
H  -3.768636 1.696257 -1.97254
H  -1.838455 -2.592183 0.387889
H  -0.394114 -1.200809 -1.805737
H  -1.770976 -2.274925 -2.162018
H  0.502168 -3.345423 -2.390633
H  -0.587307 -4.23514 -1.301372
H  1.949353 -3.831313 -0.551661
H  0.633746 -3.687615 0.65448
H  0.746331 -1.279487 0.392418
H  4.622546 0.096937 -1.400525
H  1.476903 0.285673 1.582803
H  2.040039 2.676485 2.02501
H  3.88489 3.810116 0.786301
H  5.691443 3.631148 -0.910048
H  5.985506 2.148756 -1.781267
