program: Gaussian 09
title: 000216572
version: EM64L-G09RevD.01
frameworkgroup: C1[X(C4H6N2O)]
method: RPBEPBE
basis: SDD
operation: Freq
keyword: #pfreq=noraman
keyword: PBEPBE/SDD
title: #p freq=noraman PBEPBE/SDD
converged: NO YES NO NO
title: Mulliken charges:
elementType: O N N C C C C H H H H H H
charge: -0.282434 -0.098977 0.033387 -0.386803 -0.455167 -0.246644 -0.109834 0.265534 0.265530 0.240502 0.240500 0.249577 0.284830
chargesum: 0.00000
title: Mulliken charges with hydrogens summed into heavy atoms:
elementType: O N N C C C C
charge: -0.282434 -0.098977 0.033387 0.144261 0.025834 0.002933 0.174996
polarizability: 9.76327512e+01 -1.20738104e+00 5.71340497e+01 -9.34776210e-03 -1.06171241e-04 3.27062500e+01
1716.lowfreq: -11.7654 0.0002 0.0004 0.0005 18.9826 19.6505 104.4477 162.9116 222.9230
frequency: 104.4012 162.8553 222.9174 363.5572 465.1118 494.5285 698.4608 718.5641 786.6720 814.9493 835.7325 913.3625 919.4341 1001.8639 1035.2581 1079.0595 1164.4390 1166.8745 1204.4800 1215.0592 1273.9439 1288.7794 1313.5061 1368.0470 1463.1785 1479.3342 1612.2373 2997.7605 3026.5990 3041.7602 3083.1168 3202.8039 3235.4658
redmass: 2.4225 3.2484 5.7753 6.6158 2.4374 6.9387 7.2812 1.1982 6.8784 1.2131 4.4113 1.3027 2.8261 2.4551 1.6899 1.3477 1.1732 3.5996 1.0957 2.7517 1.5155 1.5834 8.2615 2.1663 1.0984 1.0910 5.6197 1.0597 1.0600 1.1039 1.1056 1.0892 1.1084
irintensity: 1.2021 0.0040 4.4377 0.1608 20.1989 0.2944 11.8792 66.9766 35.6555 0.4134 0.9790 3.9891 15.7787 64.1785 1.5525 19.0293 2.7173 122.8898 0.0002 15.4413 13.5304 3.6571 186.9484 4.2942 8.3967 12.9833 4.2702 26.8401 9.5735 10.2455 21.0629 1.8922 3.8380
temp: 298.150 k
press: 1.00000 atm
elementType: 8 7 7 6 6 6 6 1 1 1 1 1 1
symmnumber: 1
zpe: 261707.7 jmol-1
zpe.correction: 0.099679 hartree
zpe.thermalcorrener: 0.105980 hartree
zpe.thermalcorrenthalpy: 0.106924 hartree
zpe.thermalcorrgfe: 0.069340 hartree
zpe.sumelectzpe: -340.132109 hartree
zpe.sumelectthermal: -340.125808 hartree
zpe.sumelectthermalent: -340.124864 hartree
zpe.sumelectthermalfe: -340.162448 hartree
dipole: -5.0190 -0.5488 0.0008
dipole: 5.0489
quadrupole: -48.7105 -37.2779 -40.9743
quadrupole: 0.4770 0.0013 -0.0001
quadrupole: -6.3896 5.0430 1.3466 0.4770 0.0013 -0.0001
hfenergy: -340.2317882 hartree
pointgroup: C01 [X(C4H6N2O1)]
dipole: -1.9742872 -0.2190485 0.0003245 debye
dipolederiv: -1.0640445 -0.0409822 0.0001304 0.9765984 -0.3778877 -0.0001483 0.000104 0.0000098 -0.2350764 -1.0937136 0.1230036 0.0001398 -0.0444384 -0.1084844 0.0000122 0.0002023 -0.0000198 -0.0912611 1.6594022 -0.0450337 -0.0002704 -0.5450581 0.0397172 0.0000741 -0.0002584 -0.0000015 -0.070405 0.0668779 0.0019649 0.000041 -0.0828025 0.0996819 0.0000139 0.0000094 0.0000091 0.2858084 -0.0677913 0.0441503 0.0000374 0.0003841 -0.040847 0.0000144 0.0000843 0.0000236 0.2252145 -0.1768732 0.0338761 0.0000004 0.1204589 0.1036216 -0.0000397 -0.0000499 -0.000036 -0.2982969 0.4249643 -0.1716476 -0.0000672 -0.3359537 0.1223316 0.0000552 -0.0001046 0.0000232 -0.0849686 0.0287404 0.0317874 -0.0576397 -0.0025866 0.037123 0.0484014 -0.0336643 0.0729058 -0.0272359 0.0287763 0.0317575 0.0576207 -0.0026079 0.0371282 -0.0483929 0.0336464 -0.07292 -0.0272908 0.0494137 -0.0215492 0.0683955 -0.086274 0.0219151 0.0697747 0.1024064 0.097495 -0.0369491 0.0493468 -0.0216052 -0.0684231 -0.0862997 0.0218983 -0.0697581 -0.1024268 -0.0975003 -0.0368627 0.0003017 0.0802661 0.0000194 0.073 0.0321918 -0.0000054 0.0000294 -0.0000048 0.1863196 0.0945991 -0.0459882 0.0000158 0.0155795 0.0116103 -0.0000015 0.0000218 0.0000159 0.2110041 unknown
polarizability: 97.6364729|-1.1432535|57.1303279|-0.0093476|-0.000121|32.70625 unknown
InChI: InChI=1S/C4H6N2O/c7-5-6-3-1-2-4-6/h1,3H,2,4H2
charge 0 multiplicity 1
13 atoms
O  2.482121 -0.436159 -0.000426
N  0.357889 0.23016 -0.000101
N  1.689134 0.587032 -0.000333
C  -0.184341 -1.16559 -0.000014
C  -1.732589 -0.948484 0.000272
C  -1.899689 0.5700 0.000201
C  -0.684791 1.185416 0.000084
H  0.18986 -1.701341 0.889212
H  0.189528 -1.70128 -0.889419
H  -2.205701 -1.406543 0.888577
H  -2.206042 -1.406674 -0.88778
H  -2.86322 1.079913 0.000287
H  -0.428258 2.24395 0.000041
