program: Gaussian 09
title: 000211359
version: EM64L-G09RevD.01
frameworkgroup: C1[X(C17H27N2O5PS)]
method: RPBEPBE
basis: SDD
operation: Freq
keyword: #p
keyword: freq=noraman
keyword: PBEPBE/SDD
title: #p freq=noraman PBEPBE/SDD
converged: YES YES NO NO
title: Mulliken charges:
elementType: S P O O O O O N N C C C C C C C C C C C C C C C C C H H H H H H H H H H H H H H H H H H H H H H H H H H H
charge: -0.225502 0.870974 -0.503269 -0.479568 -0.469239 -0.334779 -0.235385 -0.371181 -0.001076 -0.330765 -0.351264 -0.405731 -0.683754 0.334051 0.366043 -0.322569 -0.339251 -0.371315 -0.348764 0.109091 0.288255 -0.208729 -0.213716 -0.792814 -0.655019 -0.652791 0.225046 0.196193 0.202463 0.187939 0.210369 0.254736 0.215818 0.209040 0.215673 0.317662 0.291337 0.237823 0.253030 0.274299 0.231188 0.230031 0.228840 0.230935 0.243707 0.270537 0.243015 0.227885 0.238192 0.212920 0.230024 0.237220 0.212142
chargesum: 0.00000
title: Mulliken charges with hydrogens summed into heavy atoms:
elementType: S P O O O O O N N C C C C C C C C C C C C C C C C C
charge: -0.225502 0.870974 -0.503269 -0.479568 -0.469239 -0.334779 -0.235385 -0.053519 -0.001076 0.090475 0.039138 0.059374 -0.043223 0.334051 0.366043 -0.031232 -0.101428 -0.118285 -0.074466 0.109091 0.288255 0.252490 0.246060 -0.035554 0.023978 0.026596
polarizability: 4.33537932e+02 8.60549501e-01 2.52293775e+02 1.47779755e+01 -3.67659054e+00 1.92692235e+02
1716.lowfreq: -16.3208 -14.6081 -2.4833 -0.0019 -0.0016 0.0015 3.6763 5.0847 12.3185
frequency: -14.2884 -8.3596 3.9239 19.9366 22.5630 23.2086 29.0266 32.2905 39.4761 49.2841 57.5033 70.9667 75.1347 85.6649 95.9769 99.4392 125.4143 133.8427 153.4980 156.6383 190.8741 195.7204 216.8307 218.2327 235.3526 238.5263 243.1592 254.5849 263.1449 275.6750 284.4753 293.5047 309.5219 331.5585 348.3083 368.7544 399.6698 412.2355 424.7222 449.0613 472.0544 489.6932 508.7470 523.7753 542.9531 561.5358 574.1409 619.5747 634.7805 685.1516 691.6486 695.6502 706.0405 730.3298 739.5807 762.3950 808.7476 813.1199 822.0919 834.5399 836.4820 840.7712 862.1880 870.6133 878.4491 881.0201 886.8463 960.9102 962.6874 973.5116 977.0605 996.2927 1005.9411 1015.5177 1023.3700 1036.9481 1047.1686 1083.8863 1087.2154 1104.5405 1105.9515 1117.4709 1118.9873 1133.1385 1134.8540 1139.9523 1160.2839 1181.8716 1202.4955 1231.6893 1253.7529 1259.1019 1267.7658 1290.6857 1303.1277 1315.0093 1318.3405 1351.9938 1355.3728 1356.4597 1362.5154 1368.9243 1386.3313 1391.8277 1393.9565 1394.7825 1416.1290 1453.3173 1457.8098 1457.9593 1458.1483 1460.4130 1472.8317 1476.0466 1476.2808 1478.0962 1478.9583 1480.0485 1486.1027 1487.2863 1488.1333 1495.6267 1549.8137 1586.8336 1611.7294 1722.2251 2960.2761 2975.7540 2977.6047 2989.2304 2991.2324 2993.0278 2996.1106 2996.7126 2999.8495 3007.9219 3044.9959 3056.8488 3058.1399 3069.8340 3072.6102 3073.9605 3075.3537 3092.0844 3093.1806 3110.2895 3111.1832 3137.4161 3149.6986 3159.5512 3169.5246 3178.8740 3576.3045
redmass: 2.7202 2.9466 4.1160 3.9912 3.8413 4.0719 6.2215 3.4823 4.2544 4.1145 2.8267 2.6552 5.4014 1.7646 5.9319 5.4938 4.7672 3.7076 1.0998 4.4618 5.3514 4.4140 2.2038 3.4178 2.1404 1.2726 1.5840 3.7227 2.4604 3.1282 3.0318 4.6997 3.6897 6.1393 3.7462 6.8304 5.0198 3.0697 5.5447 4.7567 4.8103 2.6236 4.7197 2.3769 1.6337 3.2503 4.4536 7.0128 7.0572 7.5692 7.6077 5.9112 7.5717 3.9159 1.2985 2.7456 1.0926 1.0991 2.2489 2.3123 1.9718 2.2734 1.5254 4.5640 5.3654 3.8023 2.4165 1.8655 1.3424 1.9877 2.0760 1.3547 3.0778 2.4425 2.6762 1.5912 3.3853 2.4076 3.1002 2.2414 2.2218 1.4263 1.8679 1.4248 1.4325 1.9392 1.9874 2.3425 1.5942 1.3293 1.1431 1.1387 1.3033 1.1030 1.2734 1.2439 4.1615 1.4375 1.2682 1.2515 4.3685 1.3539 1.3042 1.2117 1.2451 1.2439 3.8448 1.1549 1.0420 1.1350 1.0401 1.0835 1.3026 1.1361 1.1411 1.0523 1.0472 1.0471 1.0822 1.0795 1.0803 2.5470 5.3311 7.7155 6.2445 10.3027 1.0595 1.0366 1.0608 1.0549 1.0518 1.0393 1.0405 1.0384 1.0670 1.0941 1.1003 1.1076 1.1080 1.0974 1.1009 1.1011 1.1007 1.0982 1.0981 1.1023 1.1023 1.0962 1.0877 1.0887 1.0964 1.0977 1.0773
irintensity: 0.7180 0.1772 0.2264 2.5696 0.6094 4.0411 0.8846 2.4792 3.4276 1.8752 0.8059 2.8793 1.5537 0.1498 0.4295 2.6748 0.5513 1.2057 1.1100 0.6392 1.3110 6.7417 2.2586 8.8863 1.7747 1.2980 4.6620 6.8139 12.1383 19.7076 0.8917 2.0017 0.6641 6.4689 1.5068 13.4622 9.1549 0.2722 0.2897 8.5434 24.9607 14.8516 10.3801 63.1905 65.9788 44.3074 9.4322 32.1195 1.5904 68.1071 63.3041 95.7374 135.8250 3.6704 10.5170 134.6390 2.0667 3.9555 13.4445 128.4227 134.5051 56.4515 64.4086 249.8229 162.4861 172.0490 228.1118 343.4265 0.4340 10.0511 65.6593 0.9609 22.0922 152.9779 99.4534 0.5256 55.3965 17.4067 122.0026 13.5434 10.0856 10.0287 8.6795 3.8335 4.8569 1.3960 179.8327 257.3889 47.8882 17.2466 0.5462 0.4726 50.5217 0.2458 1.0918 39.2402 129.1901 3.4688 8.1442 7.5239 0.8097 2.7608 37.5598 8.9057 28.0468 28.1867 14.3586 72.6768 12.0967 5.8389 12.9817 8.8455 299.0098 122.9625 66.3048 8.4245 33.9483 19.4196 7.0169 17.7549 12.0077 70.2678 8.0865 11.5610 54.0570 213.2042 29.0772 30.3967 50.0327 21.4028 23.4739 13.7779 27.4091 25.5677 43.9166 3.5613 54.9571 11.4384 10.6636 10.8834 49.3072 18.4768 77.4794 30.7842 25.6536 33.0964 32.1759 15.1206 7.0775 1.1785 4.9244 3.0284 32.0185
temp: 298.150 k
press: 1.00000 atm
elementType: 16 15 8 8 8 8 8 7 7 6 6 6 6 6 6 6 6 6 6 6 6 6 6 6 6 6 1 1 1 1 1 1 1 1 1 1 1 1 1 1 1 1 1 1 1 1 1 1 1 1 1 1 1
symmnumber: 1
zpe: 1111233.1 jmol-1
zpe.correction: 0.423246 hartree
zpe.thermalcorrener: 0.453175 hartree
zpe.thermalcorrenthalpy: 0.454119 hartree
zpe.thermalcorrgfe: 0.355291 hartree
zpe.sumelectzpe: -1886.872838 hartree
zpe.sumelectthermal: -1886.842910 hartree
zpe.sumelectthermalent: -1886.841966 hartree
zpe.sumelectthermalfe: -1886.940794 hartree
dipole: 0.2045 3.9899 -0.4481
dipole: 4.0202
quadrupole: -115.3818 -152.7539 -180.3509
quadrupole: 14.5604 6.7487 4.0146
quadrupole: 34.1137 -3.2584 -30.8554 14.5604 6.7487 4.0146
hfenergy: -1887.2960846 hartree
pointgroup: C01 [X(C17H27N2O5P1S1)]
dipole: 0.0595345 1.5482448 -0.3179019 debye
polarizability: 433.8835698|3.9130592|251.2150425|10.8951505|-8.8751597|193.4253287 unknown
InChI: InChI=1S/C17H27N2O5PS/c1-5-8-13-18-17(20)23-19-14(4)15-9-11-16(12-10-15)24-25(26,21-6-2)22-7-3/h9-12,18H,5-8,13H2,1-4H3
charge 0 multiplicity 1
53 atoms
S  -4.935593 -0.35436 2.273007
P  -5.093154 -0.324335 0.218829
O  -3.714588 -0.827623 -0.728225
O  -5.447034 1.180555 -0.54579
O  -6.290954 -1.320887 -0.509048
O  3.893688 0.606783 0.414789
O  4.613904 -1.665749 0.745605
N  6.065508 0.1784 0.880446
N  2.542654 0.062927 0.237518
C  8.066776 -0.992706 -0.130683
C  8.615286 0.210406 -0.929631
C  7.291017 -0.59533 1.146925
C  9.411242 -0.221357 -2.180354
C  0.263212 0.558645 -0.175048
C  -2.403609 -0.327344 -0.499503
C  -0.05405 -0.831086 -0.120719
C  -0.789687 1.486097 -0.402591
C  -1.377927 -1.273498 -0.276444
C  -2.121133 1.052846 -0.568186
C  1.667316 1.0293 0.008929
C  4.854419 -0.446062 0.689288
C  -6.58479 1.989993 -0.003423
C  -6.401833 -2.748056 -0.07111
C  1.984617 2.508502 -0.068065
C  -6.551799 3.319301 -0.74991
C  -7.718275 -3.266399 -0.640462
H  7.405138 -1.604371 -0.774464
H  8.909739 -1.647651 0.171563
H  7.773185 0.861383 -1.240451
H  9.265045 0.823409 -0.270344
H  7.938442 0.008297 1.81132
H  6.991365 -1.504845 1.696463
H  8.776468 -0.812164 -2.866804
H  10.278449 -0.849352 -1.902139
H  9.7922 0.652753 -2.73957
H  6.103781 1.192909 0.783823
H  0.753624 -1.547321 0.055016
H  -0.578847 2.558628 -0.455277
H  -1.630863 -2.336665 -0.228222
H  -2.932275 1.763725 -0.754974
H  -6.443111 2.118353 1.08692
H  -7.52294 1.435479 -0.189715
H  -6.380911 -2.788418 1.035357
H  -5.532339 -3.298178 -0.475411
H  1.414228 3.066667 0.696748
H  3.056318 2.688806 0.091493
H  1.699928 2.913111 -1.056647
H  -5.603269 3.851086 -0.563411
H  -6.658837 3.159711 -1.835958
H  -7.385162 3.95948 -0.405971
H  -8.571949 -2.69722 -0.23545
H  -7.727729 -3.181499 -1.740091
H  -7.845891 -4.331074 -0.370653
