program: Gaussian 09
title: 000211354
version: EM64L-G09RevD.01
frameworkgroup: C1[X(C15H18N2O2)]
method: RPBEPBE
basis: SDD
operation: Freq
keyword: #p
keyword: freq=noraman
keyword: PBEPBE/SDD
title: #p freq=noraman PBEPBE/SDD
converged: YES YES NO NO
title: Mulliken charges:
elementType: O O N N C C C C C C C C C C C C C C C H H H H H H H H H H H H H H H H H H
charge: -0.323270 -0.270771 -0.112083 -0.464102 -0.406038 -0.376809 -0.374936 -0.394403 -0.410905 0.109261 0.250240 0.306829 -0.465217 0.193734 -0.574848 -0.326138 0.314875 -0.339328 -0.536338 0.223183 0.192532 0.204232 0.214636 0.211528 0.202408 0.208132 0.271226 0.244453 0.217002 0.252943 0.338423 0.251292 0.239205 0.249533 0.217902 0.218587 0.243027
chargesum: 0.00000
title: Mulliken charges with hydrogens summed into heavy atoms:
elementType: O O N N C C C C C C C C C C C C C C C
charge: -0.323270 -0.270771 -0.112083 -0.125679 0.009677 0.042059 0.039001 0.084955 0.050550 0.109261 0.250240 0.306829 -0.212274 0.193734 -0.323555 -0.086933 0.314875 -0.089795 0.143179
polarizability: 3.08121538e+02 4.50112506e+00 1.85837415e+02 -3.05269424e+00 1.55570834e+00 1.02590825e+02
1716.lowfreq: -10.3442 -5.3735 -0.0004 0.0004 0.0005 4.0525 27.3856 33.8722 56.5324
frequency: 27.3673 33.8390 56.5229 76.7294 105.0308 116.9869 159.6162 186.6721 216.2952 232.0797 248.0067 255.6524 288.8209 321.5475 364.9256 376.6368 380.2623 415.7403 428.9562 438.1117 462.9526 501.2010 515.1049 567.8686 597.2915 608.2674 623.4163 655.0715 658.2755 724.4390 736.0401 749.1139 793.6431 797.5608 805.0491 806.4248 823.7516 846.2874 852.4867 872.2691 904.0964 930.5451 940.8107 950.0289 964.2496 994.1843 1010.7416 1036.3386 1085.8283 1109.6485 1113.8636 1120.0215 1122.0826 1146.1571 1152.8147 1154.5602 1170.7560 1213.3652 1225.0273 1234.1755 1242.7438 1253.7839 1270.6359 1299.0992 1319.8297 1324.5081 1334.5336 1340.4912 1343.6742 1355.7080 1382.1200 1406.0257 1423.7280 1435.0558 1453.6210 1461.3727 1461.6776 1463.7492 1465.9757 1474.8405 1476.3590 1483.8973 1487.0311 1527.2593 1538.3525 1587.0280 1634.9322 2946.3134 2950.9296 2957.0978 2968.9843 2983.5046 2987.3122 3034.9517 3038.1131 3046.0064 3055.0677 3091.7717 3115.6284 3120.8295 3143.1018 3159.7547 3171.3761 3220.4915 3563.0852
redmass: 3.6441 3.8079 4.2481 4.7433 4.2230 4.3527 3.4798 3.3917 3.8215 2.8657 1.4777 2.1157 3.5750 2.6131 6.5292 4.4566 5.7287 1.9598 2.8443 2.9238 3.8170 2.4545 4.7648 3.0759 5.0191 4.4703 3.4083 1.2593 3.1451 4.0463 6.0028 3.6448 3.7456 1.5017 1.6025 1.5611 2.9086 1.4680 1.7772 3.0522 2.5825 3.9596 1.3319 1.3202 3.9288 4.2265 2.6729 2.0612 1.4159 1.7122 1.2629 1.4091 2.3394 1.5672 1.2843 1.4930 2.2641 1.5788 1.6612 2.4633 2.3117 1.2953 1.2094 1.7369 2.4008 1.4058 1.3435 1.5266 1.4671 1.4537 6.0608 4.0587 2.4356 1.4022 1.0948 1.5675 1.7067 1.0527 1.1305 1.2470 1.0894 3.0898 1.1978 4.0230 7.1155 6.5140 7.5609 1.0724 1.0334 1.0697 1.0639 1.0607 1.0612 1.1035 1.0961 1.1028 1.1034 1.0932 1.0896 1.0987 1.0889 1.0911 1.0963 1.0973 1.0802
irintensity: 0.1928 0.1465 0.8893 0.3792 8.2828 1.8507 0.4662 1.6669 10.3897 1.2111 1.5650 1.1278 1.7199 5.3246 8.5446 5.6127 2.5661 1.7468 5.1918 4.8702 0.4682 12.5293 15.2029 7.4094 1.8136 4.7680 0.5120 83.3811 6.5198 20.3094 11.3772 0.8927 1.0466 8.1231 1.2715 50.2549 1.6849 16.1944 59.5970 9.5317 6.1307 6.6716 0.2169 9.3867 15.7517 36.4722 31.2837 14.5897 0.3961 8.4600 0.1975 20.3842 3.8873 21.0872 8.4997 7.2993 152.0399 91.8705 194.2833 4.7953 202.5793 22.8874 14.0362 30.5313 3.2035 1.5899 4.4725 12.1534 5.0313 6.1982 46.7400 182.2805 47.1042 17.8143 6.4987 27.5711 31.0864 13.2933 17.8688 28.4525 14.3172 10.2460 16.1231 300.5490 183.9734 17.7857 36.3927 41.6731 65.4479 71.8784 45.8040 27.4312 35.0070 53.9874 64.7323 30.1112 96.2859 7.0320 7.0383 31.3715 6.8635 11.0140 9.3948 5.5192 104.1599
temp: 298.150 k
press: 1.00000 atm
elementType: 8 8 7 7 6 6 6 6 6 6 6 6 6 6 6 6 6 6 6 1 1 1 1 1 1 1 1 1 1 1 1 1 1 1 1 1 1
symmnumber: 1
zpe: 802143.7 jmol-1
zpe.correction: 0.305520 hartree
zpe.thermalcorrener: 0.322299 hartree
zpe.thermalcorrenthalpy: 0.323243 hartree
zpe.thermalcorrgfe: 0.260160 hartree
zpe.sumelectzpe: -840.961757 hartree
zpe.sumelectthermal: -840.944978 hartree
zpe.sumelectthermalent: -840.944034 hartree
zpe.sumelectthermalfe: -841.007117 hartree
dipole: -1.7264 4.0561 0.8613
dipole: 4.4916
quadrupole: -103.3245 -103.9148 -115.7667
quadrupole: -3.1690 -2.7207 -1.9338
quadrupole: 4.3442 3.7539 -8.0981 -3.1690 -2.7207 -1.9338
hfenergy: -841.2672775 hartree
pointgroup: C01 [X(C15H18N2O2)]
dipole: -0.6422611 -1.6432307 -0.100074 debye
polarizability: 307.6761401|-0.9653696|184.0528027|11.3513606|-11.7533679|104.8208349 unknown
InChI: InChI=1S/C15H18N2O2/c1-19-12-5-6-13-11(9-12)10-14(16-13)15(18)17-7-3-2-4-8-17/h5-6,9-10,16H,2-4,7-8H2,1H3
charge 0 multiplicity 1
37 atoms
O  -2.224423 2.355853 -0.240951
O  5.299953 -0.757509 0.358953
N  -2.942538 0.161559 -0.566651
N  0.395194 1.762128 -0.48693
C  -4.878545 -1.861682 0.250084
C  -5.045066 -0.369886 0.632674
C  -3.387714 -2.213705 0.016337
C  -4.359606 0.557999 -0.398861
C  -2.767775 -1.236793 -1.009658
C  -1.946224 1.108041 -0.379541
C  -0.512185 0.706812 -0.318527
C  1.616723 -0.104341 -0.010336
C  0.219388 -0.459438 -0.016401
C  1.695613 1.303968 -0.307625
C  2.810136 -0.847014 0.224755
C  2.936938 1.981225 -0.37735
C  4.037995 -0.162877 0.153869
C  4.101353 1.237194 -0.1433
C  5.320097 -2.185772 0.667522
H  -5.309757 -2.51072 1.035016
H  -5.446143 -2.064473 -0.682266
H  -6.117978 -0.106545 0.700324
H  -4.597248 -0.186227 1.628692
H  -2.829926 -2.143592 0.9709
H  -3.288295 -3.252058 -0.35451
H  -4.874901 0.480528 -1.379967
H  -4.378288 1.613392 -0.08471
H  -1.705265 -1.44294 -1.196084
H  -3.299418 -1.355072 -1.979208
H  -0.187277 -1.439959 0.222305
H  0.062979 2.720942 -0.605544
H  2.757558 -1.915587 0.451613
H  2.996542 3.050681 -0.604173
H  5.089694 1.704998 -0.181541
H  4.881117 -2.782914 -0.15665
H  4.776631 -2.403423 1.60868
H  6.383162 -2.442892 0.785762
