program: Gaussian 09
title: 000211353
version: EM64L-G09RevD.01
frameworkgroup: C1[X(C16H23ClN2O)]
method: RPBEPBE
basis: SDD
operation: Freq
keyword: #p
keyword: freq=noraman
keyword: PBEPBE/SDD
title: #p freq=noraman PBEPBE/SDD
converged: YES YES NO NO
title: Mulliken charges:
elementType: Cl O N N C C C C C C C C C C C C C C C C H H H H H H H H H H H H H H H H H H H H H H H
charge: -0.070555 -0.289966 -0.079925 -0.129365 -0.344225 -0.350543 -0.398280 -0.394906 -0.346781 -0.575724 0.239716 -0.498558 0.608972 -0.354410 -0.331162 -0.404526 -0.691387 -0.229605 -0.233951 -0.230660 0.212505 0.200714 0.183793 0.212637 0.260106 0.219133 0.221609 0.227849 0.214862 0.214209 0.228821 0.236349 0.218615 0.220977 0.219599 0.222323 0.239785 0.203410 0.203653 0.222915 0.255415 0.231265 0.235294
chargesum: 0.00000
title: Mulliken charges with hydrogens summed into heavy atoms:
elementType: Cl O N N C C C C C C C C C C C C C C C C
charge: -0.070555 -0.289966 -0.079925 -0.129365 0.068995 0.045888 0.080959 0.054553 0.082291 -0.110555 0.239716 -0.058966 0.608972 0.087512 -0.331162 -0.164740 -0.061409 0.025810 -0.002686 0.004634
polarizability: 2.67037907e+02 2.09272085e+01 1.90187982e+02 8.39026592e+00 -6.67988694e+00 1.37468403e+02
1716.lowfreq: -19.1656 -6.9755 -4.8778 -0.0015 0.0010 0.0025 9.5606 13.2164 24.5203
frequency: -5.8197 12.8996 24.5159 47.4729 55.5182 60.1151 71.6195 97.2964 118.3051 134.9696 148.6826 207.5601 212.6033 219.3380 239.9926 257.6390 298.4116 306.8656 325.5237 353.4609 356.0851 385.0061 407.3405 424.4690 448.1449 467.5230 480.5531 527.2038 545.8134 563.4408 600.3228 629.4790 661.6309 723.0357 741.1973 753.8017 758.8773 767.2259 790.1621 829.8334 838.4120 869.3485 876.6380 885.7513 932.7915 946.4341 955.7971 985.3573 996.1084 1006.3674 1025.5605 1039.1572 1039.6475 1043.3336 1051.1335 1055.7260 1085.4331 1090.4579 1114.7206 1121.1626 1135.0709 1139.9570 1171.2719 1179.2299 1194.5448 1213.1466 1214.4728 1220.5931 1229.2775 1263.6673 1273.7124 1282.7699 1288.3221 1289.0788 1292.1709 1306.4229 1332.0462 1339.0310 1348.4477 1359.2611 1359.8250 1374.6372 1387.2760 1389.8951 1416.6699 1425.7877 1446.9920 1454.4233 1459.0483 1462.0430 1462.2916 1466.2653 1469.2132 1470.2370 1476.9108 1483.7088 1483.8832 1574.2358 1582.2732 1605.8295 2850.5719 2868.5640 2887.5440 2958.4602 2968.7992 2969.4010 2981.2146 3007.5285 3011.3198 3011.9282 3019.3843 3030.9148 3046.4140 3053.7362 3072.3677 3075.7434 3079.6574 3091.4494 3099.6981 3125.1584 3141.7122 3158.5527 3174.3308
redmass: 4.3924 4.7251 5.6307 2.4971 2.1539 5.9514 3.6257 4.5595 3.4494 2.6093 4.8371 2.5745 3.3854 1.1341 3.3655 3.8387 3.4642 2.3300 2.8829 3.6623 4.3456 4.1068 2.1271 4.0596 3.2292 2.6898 4.5524 3.4875 3.0060 3.7457 5.0559 2.2657 6.2292 4.1170 1.1600 2.5072 1.6401 2.6292 1.3334 2.8526 1.7222 1.4676 1.3537 2.2866 2.0831 1.4705 2.4146 1.3378 2.6217 2.8789 3.0906 2.2248 2.6876 2.1000 1.8866 2.5829 1.9741 1.7164 2.0832 2.2741 2.1100 2.3400 1.1065 1.6194 1.0883 2.0375 1.6203 1.3358 2.2493 1.4972 1.3919 1.3853 1.4554 1.1364 1.2635 1.3329 1.2652 1.3261 1.5370 1.4465 1.3415 6.6914 1.4118 1.2193 2.6555 2.1708 1.1101 1.0890 1.0784 1.1983 2.0043 1.1137 1.0589 1.1423 1.0433 1.0784 1.0906 6.1026 7.8429 7.2071 1.0703 1.0708 1.0689 1.0591 1.0405 1.0645 1.0667 1.0987 1.0609 1.0618 1.0888 1.0891 1.0997 1.0892 1.0982 1.1032 1.1029 1.0953 1.0923 1.0875 1.0893 1.0947 1.0997
irintensity: 0.4420 0.0565 0.2153 0.1168 0.0870 3.0455 0.2971 0.2047 0.9714 1.7054 0.4240 7.9764 2.6627 0.0375 1.0442 0.5566 2.4614 6.8216 5.1816 12.9774 3.9168 2.0217 1.1392 2.6166 12.7295 0.3927 0.2663 6.4294 1.3725 5.5498 5.2913 4.5801 16.6456 2.5066 12.2431 15.1908 58.5251 10.6920 4.5058 5.3234 1.2235 1.1785 0.4909 6.8537 14.7302 0.9993 9.3678 0.6527 51.5446 13.2458 52.7411 5.3355 26.0965 5.6638 1.9206 1.6246 5.3047 3.4074 10.8761 12.9107 83.3377 22.0593 0.5041 1.9779 4.5313 25.1632 126.4608 2.8101 4.7032 12.1406 7.9893 33.3058 5.9943 1.9441 29.5217 16.5806 2.6049 13.6356 2.3357 6.0621 6.0837 1.8045 10.2911 11.9603 138.0955 19.2631 25.5991 5.7094 6.6969 34.2302 18.1146 8.3464 6.0359 5.0107 12.8777 13.2042 15.0025 7.1543 283.8894 0.9460 66.9850 47.4313 91.9530 21.9694 33.3107 47.5752 50.0498 13.4541 18.7443 16.0002 9.5764 52.3400 6.1815 42.5693 53.3502 17.8467 72.9874 7.6189 19.6902 5.8973 9.3290 16.9116 14.7092
temp: 298.150 k
press: 1.00000 atm
elementType: 17 8 7 7 6 6 6 6 6 6 6 6 6 6 6 6 6 6 6 6 1 1 1 1 1 1 1 1 1 1 1 1 1 1 1 1 1 1 1 1 1 1 1
symmnumber: 1
zpe: 951160.8 jmol-1
zpe.correction: 0.362278 hartree
zpe.thermalcorrener: 0.381952 hartree
zpe.thermalcorrenthalpy: 0.382897 hartree
zpe.thermalcorrgfe: 0.311377 hartree
zpe.sumelectzpe: -1266.758896 hartree
zpe.sumelectthermal: -1266.739221 hartree
zpe.sumelectthermalent: -1266.738277 hartree
zpe.sumelectthermalfe: -1266.809797 hartree
dipole: -2.8035 -4.8426 -0.9902
dipole: 5.6825
quadrupole: -126.2959 -129.2632 -128.2134
quadrupole: -8.2304 -1.2793 -1.9379
quadrupole: 1.6283 -1.3390 -0.2893 -8.2304 -1.2793 -1.9379
hfenergy: -1267.1211737 hartree
pointgroup: C01 [X(C16H23Cl1N2O1)]
dipole: 1.1611185 -1.7965046 0.6500888 debye
polarizability: 268.3356602|-17.4263283|190.0121255|9.397718|-0.7787509|136.346506 unknown
InChI: InChI=1S/C16H23ClN2O/c1-2-5-16(20)19-12-10-18(11-13-19)9-8-14-6-3-4-7-15(14)17/h3-4,6-7H,2,5,8-13H2,1H3
charge 0 multiplicity 1
43 atoms
Cl 3.37593 2.519342 0.108979
O  -4.525872 1.617375 -0.775336
N  -0.102317 -0.524887 -0.377206
N  -2.939039 -0.071618 -0.615336
C  -0.626557 0.811104 -0.769877
C  -1.056822 -1.201652 0.535074
C  -1.988382 0.668683 -1.472935
C  -2.427928 -1.37547 -0.15466
C  1.272816 -0.471691 0.175131
C  2.341631 -0.287061 -0.937508
C  -4.189683 0.474403 -0.327925
C  -5.141415 -0.361488 0.546358
C  3.744777 -0.235476 -0.362007
C  -6.510329 0.322384 0.739271
C  4.322922 0.945701 0.163277
C  4.541381 -1.410712 -0.29171
C  -7.457004 -0.518603 1.621037
C  5.611871 0.988989 0.728066
C  5.836089 -1.402403 0.270694
C  6.374235 -0.199706 0.782827
H  0.08418 1.293218 -1.463388
H  -0.738437 1.478694 0.12134
H  -1.202632 -0.628633 1.487158
H  -0.654776 -2.198834 0.794688
H  -2.433141 1.653719 -1.688126
H  -1.849471 0.11736 -2.424652
H  -2.29962 -2.04913 -1.027061
H  -3.138103 -1.842646 0.54402
H  1.471544 -1.429573 0.692541
H  1.386609 0.340157 0.934531
H  2.246814 -1.130202 -1.644391
H  2.132252 0.642271 -1.496346
H  -4.674688 -0.539434 1.537626
H  -5.287006 -1.361626 0.088532
H  -6.96607 0.503762 -0.251193
H  -6.354692 1.322087 1.183549
H  4.126999 -2.342402 -0.695521
H  -7.030798 -0.680528 2.629883
H  -7.647738 -1.513205 1.173849
H  -8.432948 -0.015391 1.746847
H  6.011132 1.931211 1.114544
H  6.423607 -2.326008 0.30491
H  7.378573 -0.178684 1.218742
