program: Gaussian 09
title: 000211348
version: EM64L-G09RevD.01
frameworkgroup: C1[X(C17H25ClN4)]
method: RPBEPBE
basis: SDD
operation: Freq
keyword: #p
keyword: freq=noraman
keyword: PBEPBE/SDD
title: #p freq=noraman PBEPBE/SDD
converged: YES YES NO NO
title: Mulliken charges:
elementType: Cl N N N N C C C C C C C C C C C C C C C C C H H H H H H H H H H H H H H H H H H H H H H H H H
charge: -0.062904 -0.116266 -0.058094 -0.447563 -0.052057 -0.366055 -0.384104 -0.362250 -0.317314 -0.324178 -0.674788 -0.666609 -0.616085 0.388355 0.275706 -0.035827 -0.331035 -0.329772 -0.367206 -0.294492 -0.273596 -0.092349 0.205354 0.192302 0.212420 0.223093 0.220110 0.204453 0.189031 0.204428 0.191027 0.213956 0.276134 0.211201 0.205667 0.220805 0.214251 0.209109 0.207990 0.196044 0.230721 0.247579 0.262560 0.196414 0.233063 0.285929 0.254840
chargesum: 0.00000
title: Mulliken charges with hydrogens summed into heavy atoms:
elementType: Cl N N N N C C C C C C C C C C C C C C C C C
charge: -0.062904 -0.116266 -0.058094 -0.171429 -0.052057 0.031601 0.051409 0.062312 0.076145 0.080805 -0.037115 -0.035259 0.058259 0.388355 0.275706 -0.035827 -0.068475 -0.133358 -0.134142 -0.008563 -0.018755 -0.092349
polarizability: 2.85706896e+02 -4.33729098e+01 2.40906858e+02 -2.32915833e+01 -2.95465493e+01 1.69758706e+02
1716.lowfreq: -12.9484 -6.9631 -5.9775 -0.0008 -0.0003 0.0012 9.1289 13.4563 17.8157
frequency: 6.7664 12.6282 17.3780 27.8398 46.1044 66.9613 80.1491 84.7480 97.1767 122.8803 131.8241 152.9337 177.7018 188.5493 204.1373 224.8917 234.3587 239.1965 263.8555 283.5236 284.3795 302.7785 323.2810 344.2828 363.9657 374.2968 420.9245 427.0616 435.5819 460.0494 470.7584 479.1242 503.1017 519.5413 556.2062 577.9864 611.4145 640.7086 647.7633 696.8144 753.2756 758.4439 781.0856 793.5846 798.9039 807.2325 816.6906 842.5603 859.8296 865.6007 889.7561 897.6479 918.6370 931.6705 941.1143 964.4037 998.6094 1022.2300 1031.9808 1058.4400 1065.6892 1068.3476 1072.6060 1082.6403 1084.9563 1091.9694 1109.6407 1113.3858 1132.5058 1162.1506 1184.4826 1198.7909 1203.9711 1212.7584 1228.2034 1244.4357 1260.6010 1281.9480 1284.4010 1295.2209 1310.6222 1314.8996 1323.5559 1355.7507 1358.2055 1362.2829 1365.6209 1377.6858 1385.8570 1386.5731 1387.5229 1410.2879 1423.3048 1439.5060 1455.4909 1459.8163 1461.0332 1461.2219 1465.2216 1471.5877 1473.2602 1477.3940 1480.0762 1486.1461 1487.2163 1491.3241 1531.0026 1562.1698 1581.9021 1610.0912 2855.4076 2863.7593 2877.7105 2891.2645 2900.2828 2981.0726 2981.9011 2999.4136 3021.0554 3024.8975 3032.1356 3036.2015 3046.3334 3062.3048 3074.9650 3078.2787 3082.0693 3087.7488 3105.4007 3117.1580 3119.7934 3173.2093 3182.8649 3186.8819 3428.2674
redmass: 3.9060 4.1514 5.1849 3.7099 3.3678 3.2574 2.1585 2.2953 4.0172 4.5101 2.0432 2.8322 1.4098 1.2592 3.8174 1.3605 3.9158 4.1154 5.0649 1.9369 2.4794 2.5225 2.3713 3.2394 2.2224 2.5284 3.4177 2.7494 2.0984 2.5031 3.4580 3.7308 3.2736 6.2164 3.7396 7.3594 6.1269 3.4978 6.7982 2.2713 5.1471 1.8815 1.2588 1.1336 1.3244 2.6188 4.3939 4.0563 1.3015 3.2532 3.4409 1.5005 1.9919 1.3464 1.8913 1.3885 2.6392 2.1855 2.3897 1.8650 2.1664 2.0759 1.8508 2.3680 1.9028 2.5137 1.7230 2.0010 1.7542 1.5073 2.5490 2.2204 2.1463 2.6858 1.4168 1.4513 1.3770 1.1613 1.2046 1.2014 2.6974 1.3016 2.0198 2.1282 1.6035 1.3924 1.4033 1.3825 1.4475 1.3182 2.3124 2.3799 1.3243 2.4997 1.1218 1.0557 1.0707 1.1716 1.1729 1.0760 1.1142 1.0761 1.0943 1.2446 1.1578 1.1149 4.7681 3.0900 7.1471 6.6093 1.0722 1.0720 1.0709 1.0648 1.0557 1.0354 1.0357 1.0605 1.0885 1.0906 1.0872 1.0878 1.0786 1.1011 1.0983 1.0984 1.1000 1.1004 1.1017 1.0885 1.0903 1.0950 1.0932 1.0932 1.0751
irintensity: 0.1138 0.1740 0.7314 0.1460 0.8343 0.1571 0.1284 0.2546 0.5763 0.2137 0.6620 2.3735 2.3110 0.1324 0.4871 0.1050 1.0018 0.5632 0.0821 4.0379 2.1671 0.7120 10.5872 3.3414 14.1301 18.6836 4.8482 6.0624 61.4844 3.0582 27.5050 15.2814 14.9976 2.6429 2.7552 14.9110 0.0515 6.0671 3.5871 9.9054 0.8557 23.5331 5.2021 4.9043 7.5587 27.6589 6.1797 58.9961 29.9495 29.5506 14.1494 31.2760 0.6744 0.5028 2.8663 0.0717 31.7877 19.8171 1.8144 2.1729 45.3100 11.0817 20.2993 5.4484 18.5258 4.7038 14.2305 13.5866 6.6634 5.7737 19.6006 31.0555 16.2823 1.5325 8.2423 1.2482 12.6837 1.4985 4.6345 33.5502 12.6194 3.2983 26.2104 44.2161 5.0615 5.7053 3.3205 4.4700 42.7145 2.2576 76.7033 19.3495 12.2683 35.7906 3.0929 8.8555 6.2253 10.6718 8.9654 1.2750 12.0254 2.3908 13.3255 8.7432 28.1962 13.5495 31.3231 88.1327 337.6552 71.8921 47.7791 59.7353 217.3938 12.1173 125.7027 27.2833 24.6757 21.1229 35.7951 2.3699 10.6890 15.8324 26.4051 57.5424 44.8296 63.7333 76.3409 44.8001 29.5250 20.3953 31.5630 4.7554 0.8074 4.5887 51.9376
temp: 298.150 k
press: 1.00000 atm
elementType: 17 7 7 7 7 6 6 6 6 6 6 6 6 6 6 6 6 6 6 6 6 6 1 1 1 1 1 1 1 1 1 1 1 1 1 1 1 1 1 1 1 1 1 1 1 1 1
symmnumber: 1
zpe: 1032263.8 jmol-1
zpe.correction: 0.393169 hartree
zpe.thermalcorrener: 0.416747 hartree
zpe.thermalcorrenthalpy: 0.417691 hartree
zpe.thermalcorrgfe: 0.335456 hartree
zpe.sumelectzpe: -1340.152019 hartree
zpe.sumelectthermal: -1340.128441 hartree
zpe.sumelectthermalent: -1340.127497 hartree
zpe.sumelectthermalfe: -1340.209732 hartree
dipole: -7.2943 -0.1355 2.1741
dipole: 7.6126
quadrupole: -153.6483 -137.1124 -138.5662
quadrupole: -2.2197 3.1727 2.6587
quadrupole: -10.5394 5.9966 4.5428 -2.2197 3.1727 2.6587
hfenergy: -1340.5451879 hartree
pointgroup: C01 [X(C17H25Cl1N4)]
dipole: -2.8050771 0.4947593 0.9257027 debye
polarizability: 264.5737041|-46.081693|265.0159724|-34.2192009|-14.7955184|166.7827834 unknown
InChI: InChI=1S/C17H25ClN4/c1-4-22(5-2)12-6-11-21(3)20-16-9-10-19-17-13-14(18)7-8-15(16)17/h7-10,13,20H,4-6,11-12H2,1-3H3
charge 0 multiplicity 1
47 atoms
Cl 4.735939 -3.776284 -0.021077
N  -3.941321 -0.690386 -0.518634
N  -1.058363 2.147144 1.037734
N  -0.195048 1.015917 0.973469
N  3.441352 1.087385 -1.290782
C  -3.858887 0.645386 -1.173591
C  -2.53745 1.380425 -0.852248
C  -2.44701 1.768422 0.632801
C  -5.341906 -1.117969 -0.247014
C  -3.162948 -1.728057 -1.253445
C  -5.974693 -0.391366 0.955248
C  -2.683665 -2.875628 -0.344229
C  -0.99416 2.786002 2.38017
C  0.979998 1.034835 0.236311
C  1.84137 -0.136559 0.200589
C  3.060994 -0.044583 -0.579552
C  1.380331 2.173357 -0.494534
C  1.552733 -1.361325 0.882744
C  2.596733 2.141834 -1.226243
C  3.941178 -1.175225 -0.6368
C  2.419725 -2.456538 0.817185
C  3.612612 -2.337588 0.050076
H  -3.976137 0.563665 -2.282481
H  -4.707292 1.25891 -0.815827
H  -2.45146 2.284776 -1.484206
H  -1.678557 0.73223 -1.107376
H  -2.826822 0.916788 1.248245
H  -3.088291 2.645844 0.84077
H  -5.989004 -0.987301 -1.151676
H  -5.325404 -2.201673 -0.030217
H  -3.752608 -2.14308 -2.109456
H  -2.276423 -1.238962 -1.696813
H  -0.456441 0.184603 1.517834
H  -6.998471 -0.76809 1.137403
H  -6.046671 0.699331 0.791202
H  -5.369581 -0.560922 1.863251
H  -2.102013 -3.613998 -0.926693
H  -3.528284 -3.409464 0.12786
H  -2.040807 -2.478714 0.461856
H  -1.390288 2.133588 3.194485
H  -1.586104 3.717379 2.359741
H  0.053526 3.040201 2.608509
H  0.748435 3.06353 -0.488487
H  0.638401 -1.475954 1.477635
H  2.902396 3.030469 -1.792513
H  4.853723 -1.079035 -1.230109
H  2.193063 -3.388919 1.341385
