program: Gaussian 09
title: 000216622
version: EM64L-G09RevD.01
frameworkgroup: C1[X(C22H33N3O)]
method: RPBEPBE
basis: SDD
operation: Freq
keyword: #p
keyword: freq=noraman
keyword: PBEPBE/SDD
title: #p freq=noraman PBEPBE/SDD
converged: NO YES NO NO
title: Mulliken charges:
elementType: O N N N C C C C C C C C C C C C C C C C C C C C C C H H H H H H H H H H H H H H H H H H H H H H H H H H H H H H H H H
charge: -0.306409 -0.157559 -0.383758 -0.691076 0.419994 -0.088246 -0.102132 -0.082219 -0.503771 -0.552032 -0.519852 -0.453919 -0.452386 -0.453035 -0.429591 -0.326618 -0.407885 -0.739509 0.156759 0.297122 -0.556029 -0.348712 0.335591 -0.433497 0.332012 -0.844584 0.191217 0.190827 0.192050 0.199698 0.213749 0.213312 0.195756 0.191354 0.215190 0.187525 0.195255 0.193519 0.191085 0.194447 0.192266 0.263052 0.226354 0.198398 0.184748 0.209409 0.252018 0.204774 0.271029 0.214490 0.293909 0.274812 0.197836 0.214823 0.223259 0.249003 0.223562 0.306173 0.326441
chargesum: 0.00000
title: Mulliken charges with hydrogens summed into heavy atoms:
elementType: O N N N C C C C C C C C C C C C C C C C C C C C C C
charge: -0.306409 -0.157559 -0.089849 -0.058461 0.419994 0.102971 0.088694 0.109832 -0.090324 -0.142965 -0.113308 -0.071139 -0.067781 -0.066322 0.059815 0.056527 0.053542 -0.049217 0.156759 0.297122 -0.281216 -0.150876 0.335591 -0.218674 0.332012 -0.148761
polarizability: 3.89570254e+02 4.84756358e+00 2.48238514e+02 9.89830125e+00 9.87084522e+00 1.77472789e+02
1716.lowfreq: -10.8064 -1.8854 -0.0011 -0.0007 -0.0003 14.3747 15.7607 18.0589 29.3007
frequency: 14.2917 17.0717 25.5676 39.4958 53.9952 59.6887 69.1756 101.8057 124.2173 151.7542 166.8699 181.3864 190.7632 197.8566 249.4242 268.3012 277.4352 282.8395 302.8040 306.7333 313.5824 323.8847 334.6558 357.1702 366.1625 370.9319 384.4671 392.7160 396.5382 404.2629 420.4928 435.5505 443.9978 446.6818 451.6740 478.7995 500.6470 528.4178 537.1693 557.9773 586.8821 631.1646 635.6675 640.9439 687.4456 699.1672 726.5165 751.0718 758.9840 765.9321 797.5371 806.8377 808.9825 813.8411 817.4588 823.8096 869.0506 872.2601 877.7253 901.2723 925.4167 929.8794 937.1279 940.0550 948.8238 966.9310 970.5453 974.9736 977.2585 981.4488 1014.1271 1018.0606 1039.9248 1042.7906 1046.3356 1047.6963 1050.4306 1061.1047 1076.2245 1098.5962 1101.1799 1105.1179 1105.5444 1109.3614 1113.1683 1129.7838 1157.0582 1167.5938 1178.1909 1184.2376 1198.5317 1201.9044 1249.4102 1252.9804 1266.1199 1276.9134 1279.0159 1285.7662 1288.2569 1293.6146 1296.2423 1301.4424 1308.7684 1313.6539 1317.5512 1324.6219 1327.0734 1336.0122 1340.4240 1344.1726 1349.3578 1360.0052 1362.1241 1366.7702 1370.2615 1383.3340 1389.2153 1401.3331 1422.1349 1439.5565 1452.0708 1453.3810 1462.1827 1463.7215 1467.3529 1471.7967 1474.5614 1478.2508 1479.7792 1484.5658 1488.8799 1492.3115 1507.6765 1519.7439 1559.0116 1593.5020 1626.6973 1643.0071 2871.8872 2951.1218 2958.5542 2960.6716 2961.4117 2963.5757 2967.6518 2977.3453 2977.9443 2987.7875 2990.7187 3002.6637 3003.6571 3016.3106 3017.5416 3018.7643 3023.2807 3024.6738 3026.9566 3027.6721 3031.6342 3042.3842 3060.9048 3072.1980 3082.9589 3087.7127 3090.7638 3108.5830 3133.2266 3143.7121 3567.8163 3575.5338 3707.2238
redmass: 4.2993 3.9314 4.2684 5.1826 4.7785 4.2983 2.6293 4.4966 2.8594 3.2594 1.1778 2.6740 2.3873 2.1888 2.2278 2.0622 2.7462 2.6092 2.8554 2.1465 2.7365 3.3448 3.0795 1.1881 3.3778 2.3465 3.7486 3.4224 4.1567 1.1949 2.3495 1.9894 2.5457 1.9515 1.9006 1.7991 2.0695 4.3461 3.6987 3.0617 3.2625 5.0299 3.8605 3.7749 3.8023 3.9697 1.6933 3.8030 3.4683 3.8738 1.9607 1.6410 2.7154 2.7326 1.4916 2.6181 1.5765 1.5787 1.5498 3.9022 1.4537 2.6469 2.0727 1.3744 2.0784 2.1528 2.2837 2.4649 3.7970 1.6688 2.3093 1.8576 2.1554 1.8796 1.7711 1.6160 1.7679 2.9895 2.6276 1.2142 1.6040 1.2819 1.4065 1.1972 1.1455 2.0313 2.0367 1.4466 1.5333 1.2116 2.3626 1.7202 1.5984 1.5660 1.5564 1.7790 1.7850 1.4883 1.9970 1.7277 1.7599 1.5146 1.5475 1.4397 1.4634 1.3149 2.8224 1.1731 1.4428 1.4487 1.4405 1.5810 1.4908 1.3597 1.2774 3.1264 1.2137 1.5089 2.9591 1.1846 1.0812 1.0829 1.0877 1.0888 1.0931 1.0598 1.0490 1.1369 1.1455 1.6330 1.1824 1.1243 1.0647 2.9937 6.1472 6.4108 2.6612 1.5801 1.0716 1.0399 1.0653 1.0623 1.0610 1.0605 1.0608 1.0506 1.0480 1.0809 1.0802 1.0617 1.0790 1.1027 1.0975 1.1027 1.0667 1.0972 1.1005 1.0907 1.0976 1.1003 1.1004 1.0982 1.1046 1.1020 1.0949 1.0859 1.0961 1.0918 1.0450 1.0773 1.1036
irintensity: 0.7344 0.1815 1.4247 4.7818 4.7328 1.3714 0.3923 0.5955 1.2040 3.9185 0.2357 1.3311 0.9894 0.8103 1.8875 3.0217 4.6331 2.1619 2.0675 1.1959 0.9587 1.3347 12.5103 212.3289 4.0963 0.3316 5.6258 1.8731 1.3477 68.1301 2.5696 7.1764 2.6114 1.7524 5.8195 59.0166 23.2697 17.8891 6.7511 8.3456 2.3779 2.5291 0.3150 0.4343 1.3868 15.9575 4.5285 15.3584 9.7893 1.2882 4.0786 42.4722 3.7313 2.0209 16.0585 3.3530 0.1234 0.1131 0.2378 0.1522 0.6376 8.2565 1.4398 10.0841 0.9875 1.4243 11.8292 3.7999 8.5015 14.6726 5.0974 11.5479 6.5829 9.5450 3.4455 4.3551 1.5026 24.0597 44.0328 4.1637 7.3364 2.0616 1.2953 2.5322 1.8761 9.7218 26.3877 41.7850 6.7068 1.9794 26.3522 58.9750 58.3897 31.1096 61.2749 2.7660 5.0446 21.5166 14.0992 4.7137 29.0591 69.6752 3.9007 13.1321 5.8082 0.0872 102.6248 14.6843 1.3278 3.8682 16.6359 3.4208 8.2909 2.1950 10.5611 0.7566 16.7957 9.4340 43.0444 23.5784 0.5310 0.9932 14.1796 18.8433 11.0596 19.0682 15.2366 43.6584 16.3804 257.0673 62.8851 81.7485 8.2256 46.5457 61.6565 113.0210 11.8625 320.9721 68.8951 52.0501 10.2413 32.7681 10.1355 24.7916 45.1708 81.9174 30.8170 160.2088 167.2357 23.6719 63.2861 4.6808 27.7199 6.1747 64.2004 24.3435 102.4504 3.1000 89.8690 53.5629 1.7969 48.2016 23.4520 23.3758 11.3462 24.0019 28.7101 1.4137 98.6544 9.2369 23.8899
temp: 298.150 k
press: 1.00000 atm
elementType: 8 7 7 7 6 6 6 6 6 6 6 6 6 6 6 6 6 6 6 6 6 6 6 6 6 6 1 1 1 1 1 1 1 1 1 1 1 1 1 1 1 1 1 1 1 1 1 1 1 1 1 1 1 1 1 1 1 1 1
symmnumber: 1
zpe: 1354164.9 jmol-1
zpe.correction: 0.515774 hartree
zpe.thermalcorrener: 0.540811 hartree
zpe.thermalcorrenthalpy: 0.541755 hartree
zpe.thermalcorrgfe: 0.459620 hartree
zpe.sumelectzpe: -1095.655063 hartree
zpe.sumelectthermal: -1095.630026 hartree
zpe.sumelectthermalent: -1095.629082 hartree
zpe.sumelectthermalfe: -1095.711217 hartree
dipole: -3.0036 -4.4103 -0.0723
dipole: 5.3364
quadrupole: -106.9594 -152.5544 -163.2305
quadrupole: 13.5575 6.3120 2.6357
quadrupole: 33.9554 -11.6396 -22.3157 13.5575 6.3120 2.6357
hfenergy: -1096.1708373 hartree
pointgroup: C01 [X(C22H33N3O1)]
dipole: 1.209798 -1.6489401 0.4746741 debye
polarizability: 388.5269925|2.4289976|239.9163174|18.6084288|-24.4520938|186.8382464 unknown
InChI: InChI=1S/C22H33N3O/c1-3-25(22-12-16-9-17(13-22)11-18(10-16)14-22)7-6-24-21(26)19-4-5-20(23)15(2)8-19/h4-5,8,16-18,24H,3,6-7,9-14,23H2,1-2H3
charge 0 multiplicity 1
59 atoms
O  2.206654 1.548339 -0.831642
N  -2.005948 1.060296 0.217927
N  1.415964 -0.592826 -0.421794
N  7.778505 -1.163503 1.0440
C  -3.230897 0.202823 0.035406
C  -4.815867 -1.021196 -1.580443
C  -4.391459 -1.982212 0.722142
C  -5.766864 0.119731 0.473902
C  -3.522929 -0.167121 -1.461134
C  -3.101712 -1.123892 0.840658
C  -4.472093 0.966276 0.603239
C  -4.64659 -2.332318 -0.76853
C  -6.020589 -0.217539 -1.020247
C  -5.603841 -1.193963 1.281574
C  -0.700245 0.426745 0.475686
C  -1.936683 2.274256 -0.6392
C  0.028657 -0.226976 -0.749567
C  -0.96165 3.348743 -0.112899
C  2.435706 0.349591 -0.449807
C  3.802713 -0.105327 -0.035364
C  4.896956 0.750424 -0.330243
C  4.07213 -1.320259 0.648985
C  6.223095 0.430325 0.010076
C  5.386112 -1.667576 1.006012
C  6.477326 -0.808363 0.689309
C  7.371219 1.365136 -0.322175
H  -4.995638 -1.264331 -2.647105
H  -4.251407 -2.914896 1.304536
H  -6.621418 0.70055 0.874724
H  -2.661998 -0.724086 -1.882714
H  -3.636934 0.75769 -2.060124
H  -2.90188 -0.887586 1.904803
H  -2.247511 -1.721241 0.464059
H  -4.611972 1.92508 0.06745
H  -4.268053 1.214466 1.662622
H  -3.799185 -2.922922 -1.172768
H  -5.555964 -2.959545 -0.860822
H  -6.952754 -0.808964 -1.124167
H  -6.158058 0.715479 -1.603296
H  -5.446698 -0.963046 2.354264
H  -6.524084 -1.807788 1.207108
H  -0.017602 1.200959 0.866681
H  -0.800774 -0.324761 1.276764
H  -2.949707 2.713169 -0.678973
H  -1.658008 2.039877 -1.69596
H  -0.501712 -1.134794 -1.090869
H  0.05834 0.497462 -1.582737
H  -1.099418 4.284338 -0.68689
H  0.093508 3.04445 -0.227683
H  -1.162261 3.562325 0.952915
H  1.625294 -1.557354 -0.168445
H  4.670394 1.694157 -0.839275
H  3.26272 -1.999233 0.945318
H  5.576974 -2.604661 1.543682
H  8.115854 0.885495 -0.990041
H  7.004718 2.268731 -0.835672
H  7.908347 1.699605 0.589052
H  7.962834 -2.037448 1.527823
H  8.563481 -0.554489 0.836071
