program: Gaussian 09
title: 000211343
version: EM64L-G09RevD.01
frameworkgroup: C1[X(C4H6Cl3NS)]
method: RPBEPBE
basis: SDD
operation: Freq
keyword: #p
keyword: freq=noraman
keyword: PBEPBE/SDD
title: #p freq=noraman PBEPBE/SDD
converged: YES YES NO NO
title: Mulliken charges:
elementType: Cl Cl Cl S N C C C C H H H H H H
charge: 0.101616 0.088385 0.094747 0.213609 -0.228897 -0.395596 -0.377225 -0.662322 -0.483501 0.326261 0.240730 0.255648 0.296751 0.270499 0.259295
chargesum: 0.00000
title: Mulliken charges with hydrogens summed into heavy atoms:
elementType: Cl Cl Cl S N C C C C
charge: 0.101616 0.088385 0.094747 0.213609 0.067854 -0.069335 0.119153 -0.132528 -0.483501
polarizability: 1.08499621e+02 -2.37162418e-01 9.88899745e+01 1.02705611e+01 1.39244155e+00 7.65318090e+01
1716.lowfreq: -11.8520 -0.0030 -0.0027 0.0010 9.8360 17.1281 70.5372 98.4847 131.0411
frequency: 70.2000 98.4208 131.0334 168.9680 207.4483 220.2030 254.1145 268.3242 325.4929 371.6731 464.3307 479.3944 536.4562 605.4736 651.8012 665.2288 711.9299 769.6075 866.1229 918.7424 939.9404 1010.2851 1022.5458 1122.4688 1158.0229 1188.5511 1209.1426 1269.5162 1334.5663 1357.7526 1442.5964 1454.9457 1472.0379 3027.2592 3034.2516 3063.1028 3091.0748 3117.5520 3523.1264
redmass: 6.0372 3.7357 14.0626 10.3676 17.6167 4.0944 4.0214 11.8665 10.6969 6.7200 2.3340 4.4832 4.8678 3.4482 3.6848 6.6706 8.2361 3.5620 1.6955 3.0646 3.2896 1.9512 2.0790 1.1609 1.4991 3.9505 1.2936 1.1915 1.1749 1.2837 1.1764 1.1016 1.0823 1.0579 1.0603 1.0862 1.1054 1.1090 1.0770
irintensity: 0.3946 1.6771 0.3253 0.7941 0.5452 1.0012 2.9617 2.2489 0.1614 2.0134 29.0241 31.0886 4.0731 162.5142 1.6832 144.2288 92.8775 83.8392 2.4518 20.1347 15.4353 2.2470 5.6781 2.9568 0.8643 33.0529 9.0012 12.4418 0.7833 6.5800 9.9090 5.9410 9.6134 18.4900 52.7248 2.3810 5.7406 19.4031 16.6041
temp: 298.150 k
press: 1.00000 atm
elementType: 17 17 17 16 7 6 6 6 6 1 1 1 1 1 1
symmnumber: 1
zpe: 260927.7 jmol-1
zpe.correction: 0.099382 hartree
zpe.thermalcorrener: 0.109438 hartree
zpe.thermalcorrenthalpy: 0.110382 hartree
zpe.thermalcorrgfe: 0.062830 hartree
zpe.sumelectzpe: -1988.284200 hartree
zpe.sumelectthermal: -1988.274144 hartree
zpe.sumelectthermalent: -1988.273200 hartree
zpe.sumelectthermalfe: -1988.320753 hartree
dipole: 3.5936 -1.9960 -1.5051
dipole: 4.3776
quadrupole: -75.9074 -84.2593 -77.8177
quadrupole: -6.0602 0.1496 1.8687
quadrupole: 3.4208 -4.9312 1.5104 -6.0602 0.1496 1.8687
hfenergy: -1988.3835821 hartree
pointgroup: C01 [X(C4H6Cl3N1S1)]
dipole: -1.5112845 -0.5395186 0.625406 debye
dipolederiv: -0.4683528 -0.3023917 -0.0374754 -0.3273321 -0.5582968 -0.0632915 -0.0351575 -0.0780822 -0.1566858 -0.4744854 0.3362807 -0.0950336 0.4028467 -0.6150653 0.1511392 -0.0970063 0.1653284 -0.229005 -0.2080403 -0.0156366 -0.1555916 0.0053323 -0.1419296 -0.0899698 -0.0849972 -0.1051872 -0.7248316 -0.2508371 0.1976887 0.0116203 0.1131268 -0.3249081 0.0129086 0.0127932 0.0171069 -0.1330555 -0.5946904 0.0447555 -0.0238618 -0.0591714 -0.8829 0.0703487 -0.0053466 -0.052352 -0.206053 0.5890297 -0.0168886 -0.1771568 -0.1509548 0.6017593 -0.0403973 -0.1713755 -0.1075712 -0.0097517 0.2106174 -0.1263535 0.0345655 -0.0733786 0.3361336 -0.0341975 0.1623206 0.079992 0.2535838 0.244698 0.01628 -0.0092249 0.1825059 -0.1434613 -0.0103301 -0.0251176 -0.0696394 0.1191665 0.9814529 -0.0251789 0.3498566 0.0440929 1.2558714 -0.0257529 0.2575611 0.0866717 1.0901741 -0.0196369 0.0058131 -0.0052084 0.0092696 0.0600061 0.0279174 -0.047224 0.0038165 -0.0229905 -0.0363046 -0.1001201 0.0033071 -0.1404254 -0.0325075 0.0130884 0.0441529 0.0472458 0.0954323 0.0889343 0.0440454 0.0569586 0.0475816 0.0502641 0.0000104 -0.0174242 -0.0388353 -0.0935072 0.0698523 -0.0851939 0.0260869 0.0032855 0.2733706 -0.0498012 -0.0077351 0.0231865 0.0785445 -0.017762 0.0234042 -0.0636554 0.0182518 0.0753641 0.0409 -0.102497 0.0550079 -0.0262685 -0.1144752 0.0034956 0.0848128 -0.0750307 0.0462995 -0.0025725 0.1170533 -0.0266884 -0.0347525 unknown
polarizability: 109.0541732|-2.3611587|99.5145725|8.1611785|-1.6009262|75.3526592 unknown
InChI: InChI=1S/C4H6Cl3NS/c5-4(6,7)3-8-1-2-9-3/h3,8H,1-2H2
charge 0 multiplicity 1
15 atoms
Cl 2.302097 1.31492 0.046508
Cl 2.201957 -1.684775 0.414114
Cl 0.805504 -0.413212 -1.951875
S  -0.990746 1.602033 0.335005
N  -0.971705 -1.132425 0.675032
C  -0.030641 -0.047281 0.761907
C  -2.10196 -0.858159 -0.239222
C  -2.567569 0.610226 -0.0205
C  1.214319 -0.194175 -0.155695
H  0.370748 0.058336 1.784178
H  -2.91502 -1.577272 -0.03793
H  -1.775442 -0.98884 -1.283373
H  -1.241296 -1.516264 1.584606
H  -3.036229 1.028104 -0.925446
H  -3.247417 0.708181 0.841492
