program: Gaussian 09
title: 000211339
version: EM64L-G09RevD.01
frameworkgroup: C1[X(C9H16N2)]
method: RPBEPBE
basis: SDD
operation: Freq
keyword: #pfreq=noraman
keyword: PBEPBE/SDD
title: #p freq=noraman PBEPBE/SDD
converged: YES YES NO NO
title: Mulliken charges:
elementType: N N C C C C C C C C C H H H H H H H H H H H H H H H H
charge: -0.354811 -0.031416 0.324709 -0.483754 -0.432460 -0.408179 -0.407261 -0.389194 -0.369391 -0.241611 -0.693852 0.203843 0.225618 0.218989 0.206977 0.230111 0.203126 0.202338 0.227845 0.189589 0.207677 0.259511 0.223352 0.211619 0.254681 0.204462 0.217483
chargesum: 0.00000
title: Mulliken charges with hydrogens summed into heavy atoms:
elementType: N N C C C C C C C C C
charge: -0.095300 -0.031416 0.324709 -0.054292 -0.006495 0.025058 0.022922 0.008072 0.065580 -0.241611 -0.017227
polarizability: 1.18341463e+02 2.97183883e-01 1.00328397e+02 -2.75279384e-01 -3.11845817e+00 9.32834259e+01
1716.lowfreq: -7.3083 -5.4524 0.0003 0.0005 0.0006 20.8899 45.6595 72.1659 109.6871
frequency: 45.4501 71.9525 109.6386 128.2695 144.1683 206.0245 240.9324 264.9210 297.8770 314.7329 376.1697 388.6345 426.9848 446.8048 505.4308 567.2140 576.0139 629.7289 648.6591 780.4794 787.0303 814.0277 844.8266 883.2629 910.8821 919.0523 936.6242 966.5446 1032.7542 1052.7243 1059.8387 1094.8921 1099.1745 1129.6621 1137.6873 1152.6729 1161.1372 1218.7407 1255.7807 1264.1780 1266.8208 1288.8319 1309.3721 1332.7670 1338.1878 1342.4510 1345.1476 1356.1969 1391.4593 1453.6094 1456.9903 1462.3271 1464.9567 1472.2105 1475.1372 1477.7494 1478.3621 1488.0189 2147.3632 2969.3468 2973.9951 2977.0525 2977.7980 2980.8397 2984.8747 2992.3325 3035.4912 3035.8992 3040.6811 3042.4244 3050.3969 3059.2239 3068.7099 3091.2744 3445.0508
redmass: 2.1835 3.4524 4.6348 3.4917 3.3855 1.9852 1.9543 1.3943 2.5747 2.8746 2.1175 3.1496 2.1885 2.9793 1.6530 4.7524 3.2157 2.9065 2.6225 1.3258 1.3576 2.1539 1.9266 1.8540 2.1736 1.9218 1.4464 2.5190 3.2206 1.8047 1.5981 1.5243 2.0705 1.6462 1.8346 2.2938 2.5583 1.9264 1.3342 1.2342 1.4110 1.2398 1.3657 1.4849 1.3180 1.3316 1.4282 1.4361 1.2134 1.1781 1.1033 1.0886 1.0875 1.0788 1.0518 1.0834 1.0658 1.0785 12.6715 1.0638 1.0444 1.0580 1.0593 1.0617 1.0632 1.0618 1.1002 1.0955 1.0973 1.1010 1.1031 1.1030 1.0984 1.1006 1.0744
irintensity: 0.3075 2.2306 2.6038 2.6857 1.2425 1.9550 0.1636 0.6823 0.6012 2.5964 6.0116 10.2300 4.9093 4.9776 5.5185 1.3875 62.2859 2.7205 29.8639 5.4635 8.9810 0.4591 8.1447 3.0074 9.4699 7.9350 4.7776 4.1565 1.4267 1.8130 2.0646 1.6350 19.2838 30.2769 8.0406 8.6108 42.2350 4.9376 3.6903 2.4690 6.2002 1.1589 0.6718 6.2146 0.6363 5.6200 1.0980 3.1156 22.8486 17.8493 5.5893 6.9162 10.1417 19.4968 0.2576 4.0618 9.0898 12.8852 6.5170 36.2095 31.0806 47.9842 29.5870 18.0645 37.6960 23.8912 52.9835 57.6176 13.4961 9.7086 33.4206 53.5385 56.3137 36.1091 0.4446
temp: 298.150 k
press: 1.00000 atm
elementType: 7 7 6 6 6 6 6 6 6 6 6 1 1 1 1 1 1 1 1 1 1 1 1 1 1 1 1
symmnumber: 1
zpe: 621848.4 jmol-1
zpe.correction: 0.236850 hartree
zpe.thermalcorrener: 0.248730 hartree
zpe.thermalcorrenthalpy: 0.249674 hartree
zpe.thermalcorrgfe: 0.199210 hartree
zpe.sumelectzpe: -461.162005 hartree
zpe.sumelectthermal: -461.150125 hartree
zpe.sumelectthermalent: -461.149181 hartree
zpe.sumelectthermalfe: -461.199644 hartree
dipole: -0.6153 -2.7063 1.4326
dipole: 3.1233
quadrupole: -62.9193 -78.6482 -66.5204
quadrupole: -2.2945 1.0220 5.2393
quadrupole: 6.4433 -9.2855 2.8422 -2.2945 1.0220 5.2393
hfenergy: -461.3988545 hartree
pointgroup: C01 [X(C9H16N2)]
dipole: -0.240212 -1.172078 0.280203 debye
polarizability: 118.3361465|0.4668977|101.3941894|0.240258|-1.0524418|92.22295 unknown
InChI: InChI=1S/C9H16N2/c1-2-11-9(8-10)6-4-3-5-7-9/h11H,2-7H2,1H3
charge 0 multiplicity 1
27 atoms
N  1.375946 -1.047538 0.530181
N  0.69451 2.28251 -0.26988
C  0.134983 -0.322443 0.173556
C  -0.854123 -0.445133 1.374854
C  -0.529783 -0.944008 -1.095033
C  -2.24053 0.168134 1.077669
C  -1.913619 -0.326796 -1.402614
C  -2.868569 -0.452604 -0.192422
C  2.568513 -0.969006 -0.355638
C  0.405067 1.137953 -0.080868
C  3.67357 -0.022599 0.16796
H  -0.406384 0.029053 2.270974
H  -0.951803 -1.528709 1.583228
H  -0.625471 -2.026894 -0.885098
H  0.140059 -0.835107 -1.968182
H  -2.142096 1.263823 0.94476
H  -2.901685 0.01079 1.950974
H  -2.346354 -0.83055 -2.287846
H  -1.794755 0.742031 -1.67103
H  -3.086099 -1.524973 -0.007442
H  -3.834409 0.038567 -0.416829
H  1.620925 -0.907687 1.519645
H  2.986581 -1.987216 -0.48345
H  2.241349 -0.63554 -1.357266
H  3.305471 1.014982 0.248516
H  4.027455 -0.346642 1.165868
H  4.546851 -0.027798 -0.510691
