program: Gaussian 09
title: 000216634
version: EM64L-G09RevD.01
frameworkgroup: C1[X(C23H28N2O)]
method: RPBEPBE
basis: SDD
operation: Freq
keyword: #p
keyword: freq=noraman
keyword: PBEPBE/SDD
title: #p freq=noraman PBEPBE/SDD
converged: YES YES NO NO
title: Mulliken charges:
elementType: O N N C C C C C C C C C C C C C C C C C C C C C C C H H H H H H H H H H H H H H H H H H H H H H H H H H H H
charge: -0.284038 -0.354780 -0.088832 -0.028177 0.289668 0.382754 -0.592394 0.175123 -0.395280 -0.345780 -0.378176 -0.399695 -0.392859 -0.369002 -0.317575 -0.382921 0.244813 -0.252935 -0.238647 -0.242658 -0.250415 -0.695688 -0.685218 -0.245148 -0.247845 -0.536995 0.288018 0.252390 0.246764 0.228632 0.222601 0.200079 0.337169 0.255098 0.284252 0.271728 0.250816 0.226906 0.185596 0.210905 0.218154 0.228496 0.224549 0.230297 0.224937 0.227229 0.210832 0.212776 0.222141 0.214387 0.221466 0.230824 0.227717 0.277942
chargesum: 0.00000
title: Mulliken charges with hydrogens summed into heavy atoms:
elementType: O N N C C C C C C C C C C C C C C C C C C C C C C C
charge: -0.284038 -0.017611 -0.088832 -0.028177 0.289668 0.382754 -0.051987 0.175123 0.080115 0.076901 -0.123077 -0.115443 -0.121131 -0.118185 0.094928 0.046137 0.244813 -0.024439 -0.014098 -0.012362 -0.025479 -0.044852 -0.027224 -0.014324 -0.020128 -0.259053
polarizability: 2.64869955e+02 9.87467670e+00 2.79591512e+02 1.70375343e+01 -7.88723882e+00 2.33057280e+02
1716.lowfreq: -10.5970 -7.5342 -0.7545 -0.0005 -0.0003 0.0001 10.0474 16.0132 19.8292
frequency: 7.5910 14.6581 19.7354 32.3054 38.3875 45.4390 55.7418 70.0272 78.3733 83.1558 95.0682 97.3588 115.9994 158.9494 165.9034 199.2719 204.5163 217.1687 232.4094 252.7214 264.5664 274.5119 278.6409 292.0989 299.2013 316.4590 334.1076 343.1956 356.2452 400.3930 400.9127 404.6780 406.8071 481.2737 488.7488 526.3389 532.0891 584.9732 596.6375 613.2170 616.9637 620.2541 625.6651 645.5489 651.7703 705.7866 707.1236 711.1357 731.4400 749.5732 765.6638 767.9751 769.2482 795.2495 802.0505 848.7020 857.0150 860.0003 887.6308 896.9746 923.2990 933.6408 962.0756 975.6331 981.1190 982.4521 988.8558 991.1288 991.9466 997.9100 998.2578 1010.6708 1023.2219 1031.4918 1035.4490 1050.8321 1063.8135 1073.1625 1074.5862 1087.3801 1089.8950 1098.6707 1116.1985 1167.6673 1173.0918 1174.0598 1176.9648 1187.8916 1198.9201 1200.6511 1204.4353 1226.0271 1251.5263 1260.1351 1280.8405 1301.4839 1309.2789 1322.7562 1324.9347 1327.6733 1336.2497 1341.1847 1369.7772 1371.2408 1373.4583 1376.1398 1378.7885 1387.0453 1432.7026 1433.8410 1436.4314 1442.9896 1456.7285 1466.0193 1472.2014 1476.4530 1479.0161 1481.3419 1482.5855 1484.0630 1489.2572 1499.6268 1583.7037 1587.8460 1592.8358 1607.3358 1610.2970 2136.2011 2866.4196 2906.3921 2977.5429 2982.3252 2987.6187 2996.5909 3021.5638 3025.1856 3030.8160 3037.4345 3056.2444 3071.9935 3076.0868 3081.2207 3088.2453 3094.2026 3117.7031 3122.0909 3127.3863 3130.7352 3140.2758 3143.2625 3157.5214 3158.2698 3169.6484 3172.9944 3425.5176 3533.9378
redmass: 3.4218 4.1691 5.2810 3.8759 4.0001 3.5265 2.6566 4.3786 4.2473 3.9080 3.4954 3.1159 2.8691 4.6885 1.5796 2.5414 4.0672 1.3836 3.0620 4.0977 4.0559 2.7228 1.5846 3.0795 4.3690 4.0200 3.2481 3.9259 5.2069 2.4812 2.8941 2.8509 3.6420 3.5425 2.7523 3.2199 3.3033 2.4005 2.2319 3.3398 5.9263 4.9264 1.2477 1.6756 2.3906 2.1600 1.8518 2.7475 2.4212 2.7428 1.8638 1.7980 1.1731 1.7750 1.2235 2.4547 1.2540 1.2746 3.9696 2.0413 1.5636 1.5810 3.4090 2.4831 1.6005 1.5257 3.0682 3.9544 3.7415 1.3192 1.3931 4.5124 3.6138 2.3355 2.1780 2.5154 2.2779 2.4574 2.1398 2.1867 1.6209 1.8786 1.6761 2.7875 1.0879 1.0515 1.8528 2.4095 1.1322 1.1302 2.0564 2.2806 1.4427 1.4919 1.1623 1.1854 1.3544 1.2908 1.3453 1.3549 1.3364 1.2297 1.2860 5.5111 1.3117 7.2053 1.2656 1.2576 2.2452 2.1302 1.1173 1.1251 1.0651 1.0496 1.0656 1.0668 1.9949 1.0530 2.1499 1.8560 1.0852 1.0882 5.9263 5.9694 7.1232 5.9096 6.0015 6.0486 1.0719 1.0679 1.0352 1.0386 1.0584 1.0592 1.0917 1.0595 1.0871 1.1007 1.1004 1.0991 1.0985 1.1006 1.1004 1.1058 1.0854 1.0856 1.0878 1.0877 1.0937 1.0936 1.0984 1.0962 1.0986 1.0960 1.1583 1.0777
irintensity: 0.2602 0.3400 0.8897 0.1203 0.7222 0.8586 0.5213 0.2725 0.2590 0.3578 0.0586 1.6825 0.9650 4.9404 1.8222 0.4575 0.5946 0.6429 0.7102 0.7090 0.6457 1.8809 0.9945 4.2450 2.5293 5.6466 1.0675 15.7614 0.7000 1.2535 0.5328 0.2472 14.9991 4.5873 7.3045 12.2430 16.0191 66.0488 10.2830 6.5609 2.3918 0.9500 72.3712 42.3409 38.2698 35.9838 45.9938 27.8000 5.5223 5.5090 40.9403 26.9458 1.5684 2.2485 8.0121 7.1281 0.3370 0.2107 0.3613 4.1290 1.3289 2.3016 1.7648 7.7333 0.1782 0.2837 3.3499 1.8011 0.3874 0.2196 0.1826 3.3850 11.0772 11.3553 4.0581 6.2582 13.5000 34.8252 10.7958 25.4714 1.7969 9.2912 12.4807 0.2108 0.1302 0.0677 11.3887 24.7247 4.2820 7.6567 29.3836 52.8773 6.8570 20.2309 13.3347 12.4459 2.0164 4.5797 4.6197 1.0932 2.9084 9.7319 18.6627 0.2629 4.4041 0.4773 11.4570 25.1505 11.1726 5.3128 37.0131 15.9710 9.5706 16.1616 0.6122 2.1280 136.7333 8.5071 24.2103 134.4875 6.6733 4.2793 16.3085 1.4212 144.3570 7.1575 5.5110 5.6569 75.1608 65.1164 27.8883 26.3103 50.0349 12.6305 14.5137 32.8388 13.2760 19.8918 2.3844 44.7155 70.0331 44.0312 44.4756 15.6958 4.1211 3.1359 4.1767 2.4831 30.4278 25.8461 26.2497 21.0953 14.6761 14.2142 67.9632 54.3388
temp: 298.150 k
press: 1.00000 atm
elementType: 8 7 7 6 6 6 6 6 6 6 6 6 6 6 6 6 6 6 6 6 6 6 6 6 6 6 1 1 1 1 1 1 1 1 1 1 1 1 1 1 1 1 1 1 1 1 1 1 1 1 1 1 1 1
symmnumber: 1
zpe: 1185799.9 jmol-1
zpe.correction: 0.451647 hartree
zpe.thermalcorrener: 0.478513 hartree
zpe.thermalcorrenthalpy: 0.479457 hartree
zpe.thermalcorrgfe: 0.390149 hartree
zpe.sumelectzpe: -1075.982931 hartree
zpe.sumelectthermal: -1075.956065 hartree
zpe.sumelectthermalent: -1075.955121 hartree
zpe.sumelectthermalfe: -1076.044429 hartree
dipole: -0.4377 -1.2921 -3.2183
dipole: 3.4955
quadrupole: -145.2035 -145.4238 -155.9860
quadrupole: 4.1053 -0.5387 -1.4786
quadrupole: 3.6676 3.4473 -7.1149 4.1053 -0.5387 -1.4786
hfenergy: -1076.4345779 hartree
pointgroup: C01 [X(C23H28N2O1)]
dipole: -0.2691414 -1.3053047 -0.3391745 debye
polarizability: 266.6397262|13.8390713|243.2058577|3.374267|-24.9261603|267.6731627 unknown
InChI: InChI=1S/C23H28N2O/c1-4-17-23(20-13-9-7-10-14-20,21-15-11-8-12-16-21)22(26)24-18-19-25(5-2)6-3/h1,7-16,24H,5-6,17-19H2,2-3H3
charge 0 multiplicity 1
54 atoms
O  0.920123 1.832247 0.623338
N  1.073828 -0.463429 0.863048
N  4.523299 -0.415857 -0.742481
C  -1.203633 0.609323 0.962928
C  -1.679459 -0.839892 1.212365
C  -1.96127 1.188358 -0.270468
C  -1.523828 1.599604 2.155191
C  0.352843 0.703645 0.781438
C  2.543552 -0.46511 0.773688
C  3.05181 -0.561198 -0.690399
C  -2.148764 -1.304763 2.467031
C  -1.337287 1.939602 -1.297772
C  -1.656407 -1.760501 0.125064
C  -3.369514 1.001205 -0.332154
C  4.965555 1.002753 -0.753435
C  5.19748 -1.302709 -1.72135
C  -0.794486 1.364582 3.413878
C  -2.577597 -2.643262 2.631563
C  -2.099854 2.466912 -2.366634
C  -2.076406 -3.09698 0.288569
C  -4.13079 1.535918 -1.391966
C  6.436203 1.184494 -0.334018
C  4.94573 -0.991912 -3.223642
C  -2.540254 -3.547256 1.547649
C  -3.497174 2.271394 -2.420598
C  -0.184037 1.215879 4.475239
H  -1.259936 2.609101 1.790624
H  -2.615115 1.589203 2.337562
H  2.908141 0.472566 1.2267
H  2.94341 -1.311776 1.357871
H  2.519394 0.208713 -1.296523
H  2.772939 -1.549141 -1.104185
H  0.574077 -1.34335 1.003889
H  -2.173496 -0.632055 3.32871
H  -0.262384 2.131883 -1.252098
H  -1.330976 -1.412891 -0.862384
H  -3.871647 0.412875 0.445272
H  4.322907 1.554396 -0.042932
H  4.80009 1.483518 -1.750263
H  4.871806 -2.338989 -1.506786
H  6.285005 -1.275674 -1.521973
H  -2.938864 -2.976412 3.611086
H  -1.596265 3.03993 -3.153706
H  -2.051466 -3.782714 -0.565876
H  -5.214625 1.375189 -1.417462
H  6.612051 0.719351 0.652138
H  7.136408 0.730568 -1.058784
H  6.68126 2.260448 -0.265117
H  3.867433 -1.029092 -3.466077
H  5.462583 -1.735742 -3.858624
H  5.323828 0.008313 -3.502501
H  -2.873224 -4.582973 1.677447
H  -4.084241 2.685152 -3.248278
H  0.358644 1.089055 5.393991
