program: Gaussian 09
title: 000211326
version: EM64L-G09RevD.01
frameworkgroup: C1[X(C17H20N2O3)]
method: RPBEPBE
basis: SDD
operation: Freq
keyword: #p
keyword: freq=noraman
keyword: PBEPBE/SDD
title: #p freq=noraman PBEPBE/SDD
converged: YES YES NO NO
title: Mulliken charges:
elementType: O O O N N C C C C C C C C C C C C C C C C C H H H H H H H H H H H H H H H H H H H H
charge: -0.241707 -0.459546 -0.269354 -0.124546 -0.017654 -0.113890 0.318824 0.489588 0.196729 -0.310216 -0.319692 -0.338719 -0.386434 -0.284158 -0.514352 -0.238277 -0.222496 -0.243529 -0.201595 -0.607730 -0.625337 -0.363501 0.191147 0.231307 0.247757 0.228584 0.257926 0.283812 0.266385 0.309260 0.371125 0.225871 0.227371 0.228177 0.228439 0.226820 0.250121 0.192143 0.227942 0.188759 0.254863 0.239780
chargesum: 0.00000
title: Mulliken charges with hydrogens summed into heavy atoms:
elementType: O O O N N C C C C C C C C C C C C C C C C C
charge: -0.241707 -0.088421 -0.269354 -0.124546 -0.017654 -0.113890 0.318824 0.489588 0.196729 0.112238 0.156649 -0.080793 -0.102621 -0.017772 -0.205092 -0.012406 0.004874 -0.015352 0.026844 0.061354 0.046228 -0.123721
polarizability: 2.43658518e+02 1.32425934e+01 1.91475222e+02 -4.54174067e-02 -9.45681174e+00 1.67839189e+02
1716.lowfreq: -6.3493 -0.0006 -0.0002 0.0002 3.2816 7.5984 17.0378 35.1945 48.2707
frequency: 16.8561 35.1813 48.2637 53.6268 65.9620 74.7908 82.2857 93.5482 94.9800 147.3815 184.1556 210.7834 221.9847 223.2726 245.1076 260.0147 287.8127 291.3454 305.8493 330.2671 343.4372 372.8660 385.7371 396.6089 401.3381 419.6755 426.3531 456.5607 506.7224 528.8952 588.0002 592.3063 615.8419 619.0145 675.3512 689.7741 708.8740 726.8800 731.8573 757.5857 774.7046 817.6093 821.8045 862.7689 904.2328 917.4819 939.2818 940.5669 951.7395 967.8935 979.2506 987.1353 991.1173 992.5664 1001.8224 1008.6094 1015.2114 1027.5620 1032.0681 1037.1917 1059.3599 1075.9638 1086.6813 1093.7006 1114.2716 1138.4570 1150.7947 1170.5969 1180.3446 1187.2017 1194.2196 1201.2159 1222.1334 1245.7911 1275.6244 1279.4426 1303.7919 1313.0174 1345.9350 1354.0153 1362.7517 1374.5332 1381.6805 1409.2648 1421.0302 1433.3768 1436.9975 1452.2345 1458.4811 1467.2335 1470.3885 1475.5815 1476.6379 1484.2754 1485.7164 1557.4998 1584.0210 1591.5850 1602.7665 1611.1511 2831.0952 2864.9382 2880.8904 3033.4153 3035.4175 3039.9145 3043.9408 3071.7281 3088.4266 3092.7655 3114.0621 3123.8438 3127.1494 3135.1514 3142.8745 3150.5761 3162.0391 3165.1067 3174.2302 3406.1538
redmass: 4.2705 4.0618 4.3456 4.7820 3.6491 4.2085 5.4889 3.7067 4.9822 3.8515 4.3318 1.7683 1.8142 1.6756 2.6946 2.7271 5.9099 5.2807 3.8628 2.9723 3.4759 2.4744 3.8547 3.2008 2.4639 2.1235 1.5175 3.2681 3.6069 2.8585 6.1881 6.2427 6.4162 7.5941 6.1104 6.5410 1.8177 2.1313 3.3174 3.0850 2.4287 3.7266 1.8020 1.2447 5.8094 2.4865 1.3909 1.8820 2.2120 2.5286 1.6412 1.7290 3.0874 1.4670 1.4228 3.1004 5.3382 2.3027 2.6231 1.6580 1.7373 1.9555 1.6429 1.4014 1.7245 1.4688 2.3392 1.0860 2.2361 1.2126 2.0314 2.3225 2.0483 1.4951 1.9922 1.4783 8.6606 1.3664 1.4231 1.3670 1.3513 1.3658 8.6411 2.0352 1.1389 2.2123 1.1203 1.0955 1.1077 1.1522 1.0678 1.6804 2.1638 1.0519 1.0534 5.3888 5.2141 6.3473 7.3174 6.6101 1.0705 1.0555 1.0552 1.0753 1.0748 1.0756 1.0688 1.0965 1.1014 1.1010 1.1082 1.0848 1.0880 1.0891 1.0915 1.0938 1.0975 1.0999 1.0963 1.0647
irintensity: 0.2942 0.1790 1.7673 1.4994 0.5442 0.4366 0.1360 0.6381 1.1945 0.4891 2.1994 0.3400 0.2316 1.5989 0.6516 1.5728 0.6084 15.2036 13.8783 10.2133 19.9094 24.2943 13.6689 2.9842 6.6345 0.9703 37.6475 14.0246 15.7134 4.8731 14.3052 4.1227 0.0077 21.0310 9.6787 4.4752 51.3709 49.4607 20.7401 11.0003 36.8786 10.8542 34.8709 0.4856 16.0970 11.5428 1.1657 12.6100 17.8085 25.7407 13.3402 1.3966 0.3765 2.4427 4.7501 23.6475 45.2430 14.2501 5.9990 19.5835 15.7803 7.4993 4.0918 8.2252 4.5437 7.5615 158.0142 15.0812 135.4664 0.9844 39.2332 35.6485 16.8511 21.0384 12.1579 5.0123 3.2717 0.4853 48.9482 11.1076 8.3967 3.9791 0.4388 24.6836 3.3105 14.4204 3.4100 13.1927 2.3936 17.2091 29.3859 22.8976 18.5167 6.9777 29.0607 11.3172 2.9196 0.3595 102.2307 42.7451 95.9274 88.9616 261.1229 18.2475 37.7027 7.8417 33.2348 23.1884 10.4591 35.8773 8.5062 0.0898 10.4930 14.1326 17.9902 31.2305 14.4443 28.0037 12.0772 77.1384
temp: 298.150 k
press: 1.00000 atm
elementType: 8 8 8 7 7 6 6 6 6 6 6 6 6 6 6 6 6 6 6 6 6 6 1 1 1 1 1 1 1 1 1 1 1 1 1 1 1 1 1 1 1 1
symmnumber: 1
zpe: 887636.6 jmol-1
zpe.correction: 0.338083 hartree
zpe.thermalcorrener: 0.359246 hartree
zpe.thermalcorrenthalpy: 0.360190 hartree
zpe.thermalcorrgfe: 0.286704 hartree
zpe.sumelectzpe: -993.326321 hartree
zpe.sumelectthermal: -993.305159 hartree
zpe.sumelectthermalent: -993.304214 hartree
zpe.sumelectthermalfe: -993.377700 hartree
dipole: 0.5481 -1.9391 -2.9360
dipole: 3.5610
quadrupole: -115.0319 -125.8162 -128.3067
quadrupole: -8.0309 -0.2948 1.1113
quadrupole: 8.0197 -2.7646 -5.2551 -8.0309 -0.2948 1.1113
hfenergy: -993.6644044 hartree
pointgroup: C01 [X(C17H20N2O3)]
dipole: 1.2040446 -0.6840254 -0.2126182 debye
polarizability: 183.1680103|24.5753328|206.6369116|-5.8194665|-29.717569|213.1680069 unknown
InChI: InChI=1S/C17H20N2O3/c1-19(2)11-12-22-16(20)17(21,14-7-4-3-5-8-14)15-9-6-10-18-13-15/h3-10,13,21H,11-12H2,1-2H3
charge 0 multiplicity 1
42 atoms
O  1.897742 -0.259139 0.223949
O  -1.272702 0.793672 1.732694
O  1.321923 1.353661 1.808119
N  2.695273 2.266337 -1.218711
N  -0.950192 0.944821 -2.747245
C  -0.445216 -0.115103 0.927353
C  -0.481747 -1.536983 1.540894
C  -0.983858 -0.070313 -0.512216
C  1.015835 0.41817 1.025114
C  3.498142 1.029754 -1.14712
C  3.304199 0.243516 0.15632
C  0.097325 -2.636893 0.857932
C  -1.097136 -1.744889 2.796694
C  -2.116003 -0.839274 -0.871301
C  -0.445712 0.812023 -1.483405
C  0.066674 -3.925748 1.431749
C  -1.126699 -3.037202 3.370118
C  -0.543961 -4.131344 2.692035
C  -2.656555 -0.705805 -2.167832
C  2.543075 2.752483 -2.610169
C  3.152542 3.326161 -0.293721
C  -2.042702 0.190754 -3.071477
H  4.599103 1.223924 -1.254249
H  3.202381 0.378879 -1.990417
H  3.509798 0.842742 1.058995
H  3.926307 -0.666264 0.155019
H  0.574615 -2.481437 -0.115125
H  -1.561286 -0.891716 3.299158
H  -2.565722 -1.52636 -0.14695
H  0.434516 1.4315 -1.259235
H  -0.649913 1.454426 2.153318
H  0.516944 -4.769383 0.896378
H  -1.608346 -3.187381 4.343006
H  -0.567163 -5.132719 3.13673
H  -3.534618 -1.282831 -2.474883
H  1.883735 3.637553 -2.617377
H  2.060615 1.975669 -3.22894
H  3.513275 3.038988 -3.086229
H  2.498445 4.208177 -0.403855
H  4.206479 3.647911 -0.487931
H  3.068403 2.98603 0.752005
H  -2.427917 0.319129 -4.089789
