program: Gaussian 09
title: 000211322
version: EM64L-G09RevD.01
frameworkgroup: C1[X(C19H24N2O3)]
method: RPBEPBE
basis: SDD
operation: Freq
keyword: #p
keyword: freq=noraman
keyword: PBEPBE/SDD
title: #p freq=noraman PBEPBE/SDD
converged: YES YES NO NO
title: Mulliken charges:
elementType: O O O N N C C C C C C C C C C C C C C C C C C C H H H H H H H H H H H H H H H H H H H H H H H H
charge: -0.235447 -0.460985 -0.263716 -0.131268 -0.016768 -0.106819 -0.315495 -0.323696 -0.312376 -0.292615 0.378410 0.439197 0.177769 -0.680049 -0.713283 -0.353823 -0.397204 -0.273618 -0.518434 -0.234339 -0.222056 -0.243897 -0.195548 -0.360127 0.225449 0.185184 0.231581 0.241095 0.220845 0.185293 0.207309 0.177458 0.207366 0.240574 0.209657 0.196679 0.294050 0.207507 0.250229 0.281600 0.269587 0.367971 0.308177 0.225479 0.225998 0.227441 0.229384 0.240274
chargesum: 0.00000
title: Mulliken charges with hydrogens summed into heavy atoms:
elementType: O O O N N C C C C C C C C C C C C C C C C C C C
charge: -0.235447 -0.093014 -0.263716 -0.131268 -0.016768 -0.106819 0.095138 0.148980 0.093762 0.092151 0.378410 0.439197 0.177769 -0.022452 -0.015047 -0.103595 -0.115604 -0.004031 -0.210257 -0.008860 0.003942 -0.016457 0.033835 -0.119852
polarizability: 2.56603105e+02 1.52965988e+01 2.15652415e+02 -2.27711001e+00 -6.92922207e+00 1.96957464e+02
1716.lowfreq: -14.1654 -5.5990 -0.0002 0.0003 0.0006 5.4858 11.2415 33.7656 36.4367
frequency: 3.8856 33.6867 36.0571 44.4265 49.5842 61.1031 69.0791 78.6111 80.8413 99.0649 102.9596 152.7159 168.3800 197.8765 211.1456 239.2104 246.9975 254.2776 281.0536 284.6565 293.8372 303.3044 308.8297 327.1250 353.4654 381.9242 394.6363 403.8076 422.4374 429.6697 454.8096 464.3788 518.6844 536.0816 575.2738 597.8566 615.7993 617.6935 675.7518 694.6003 703.8894 707.9227 727.5806 745.6225 772.7809 793.7029 801.2022 813.8538 819.1201 859.8164 905.3515 906.2380 912.4423 921.6260 940.8945 947.1508 969.8535 984.3721 984.6874 990.8983 997.2925 999.0356 1005.2316 1016.2216 1026.4492 1027.2762 1031.5148 1066.8094 1074.3246 1084.8190 1086.4537 1097.2570 1113.7476 1128.6096 1151.2050 1170.6351 1173.6834 1182.8728 1186.6681 1200.9012 1202.3116 1226.1501 1254.0388 1260.7220 1289.1426 1300.3181 1304.3623 1313.0396 1336.5415 1354.4179 1364.9360 1366.9755 1376.1479 1379.6385 1382.3339 1392.4297 1406.2429 1408.3662 1434.3408 1451.0610 1457.2958 1465.2534 1469.5876 1477.7577 1478.1114 1479.6522 1485.4615 1487.5379 1504.0180 1557.8898 1583.0104 1592.7135 1600.8350 1611.8124 2823.2799 2851.2810 2864.0162 2977.1586 2988.9263 3037.8764 3048.5322 3052.3495 3056.6725 3068.3235 3070.4800 3082.0227 3088.6753 3097.2776 3109.6209 3123.7390 3127.0937 3134.9828 3147.6344 3149.4399 3161.7153 3168.0392 3176.2088 3446.0659
redmass: 4.0592 4.2431 3.7207 1.8334 5.0346 3.9746 7.2786 4.7060 4.4241 3.7172 2.2605 4.9329 2.3807 2.3111 4.6475 1.5086 3.6954 3.1177 2.6441 4.0795 2.7980 2.4745 2.3856 2.7481 3.3642 4.5764 3.3275 2.7991 2.5687 1.5698 4.0992 2.6527 3.7799 3.1932 5.2039 6.7831 6.4654 7.3862 6.3725 5.3208 2.7450 1.9771 2.0185 4.3235 2.1687 1.1776 1.4372 1.9757 2.0484 1.2453 2.6646 3.2237 2.0175 2.0626 1.3864 2.0986 2.9795 1.4652 1.4582 4.9089 1.5595 1.4184 3.4328 4.0572 2.1907 2.2276 2.6537 2.1890 2.1491 1.9603 1.7729 1.9238 1.7238 1.9870 2.3484 1.1115 2.0334 2.2793 1.1900 2.2402 2.4229 2.4099 1.2734 1.2063 1.1394 1.1851 6.9656 1.4251 1.4611 1.3332 1.3360 1.3767 1.3107 1.3837 8.8181 1.2233 1.2381 1.9123 2.2145 1.0874 1.0901 1.0551 1.0780 2.1643 1.2692 1.2162 1.1905 1.0871 1.0646 5.1292 4.9244 6.4227 7.7438 6.3811 1.0713 1.0726 1.0714 1.0364 1.0360 1.0592 1.0889 1.0871 1.0853 1.0966 1.0955 1.0977 1.1014 1.1003 1.1074 1.0848 1.0885 1.0890 1.0912 1.0938 1.0982 1.0999 1.0959 1.0648
irintensity: 0.6544 0.0498 0.5868 0.0145 1.4729 0.4238 0.4125 1.2751 1.4325 0.7239 0.5605 1.1243 2.5329 0.2828 1.3329 0.4524 1.5319 7.4992 4.8749 3.1018 26.1773 5.1058 1.0993 30.8062 7.0150 22.1135 2.6392 2.0559 10.9321 57.3477 1.9932 3.4267 16.3041 6.7274 5.9895 13.6776 0.5957 18.2874 11.9663 2.6177 44.4136 30.9600 31.6776 22.3934 29.3023 8.6005 12.2781 10.8105 27.9555 0.6789 3.5117 13.2162 5.9637 4.5361 0.2106 7.1575 27.8998 1.5765 0.2032 0.4669 10.5769 3.1373 39.8144 23.3434 44.3562 12.6340 3.4092 9.2268 32.7669 4.1839 7.2273 11.6813 1.4592 6.5867 176.0148 19.4788 55.8222 53.7620 4.5324 24.8886 40.4451 23.5030 24.1904 12.1869 10.1363 9.1603 2.5433 0.2853 43.7500 6.8272 4.8667 7.1466 4.3387 2.3135 0.6700 23.3834 11.1518 32.4767 17.6480 3.4418 7.8210 5.1283 8.7542 26.8819 19.1469 0.8198 21.6280 15.0604 10.7991 10.0767 3.2195 2.9606 127.6184 18.6212 89.5476 47.7417 269.0548 35.7632 25.2966 29.9124 5.0002 7.2078 13.5213 41.6722 51.4115 51.4958 9.4069 50.3605 10.7968 0.1646 12.5410 12.3038 18.8800 34.4081 17.5441 23.5286 9.4873 51.8857
temp: 298.150 k
press: 1.00000 atm
elementType: 8 8 8 7 7 6 6 6 6 6 6 6 6 6 6 6 6 6 6 6 6 6 6 6 1 1 1 1 1 1 1 1 1 1 1 1 1 1 1 1 1 1 1 1 1 1 1 1
symmnumber: 1
zpe: 1034778.5 jmol-1
zpe.correction: 0.394126 hartree
zpe.thermalcorrener: 0.418084 hartree
zpe.thermalcorrenthalpy: 0.419029 hartree
zpe.thermalcorrgfe: 0.337405 hartree
zpe.sumelectzpe: -1071.773601 hartree
zpe.sumelectthermal: -1071.749643 hartree
zpe.sumelectthermalent: -1071.748699 hartree
zpe.sumelectthermalfe: -1071.830322 hartree
dipole: 0.6956 -1.7441 -1.9516
dipole: 2.7083
quadrupole: -132.7120 -133.3665 -142.4591
quadrupole: -6.7194 1.4800 3.2133
quadrupole: 3.4672 2.8127 -6.2799 -6.7194 1.4800 3.2133
hfenergy: -1072.1677272 hartree
pointgroup: C01 [X(C19H24N2O3)]
dipole: -0.9654772 0.3573021 0.2747795 debye
polarizability: 213.5254885|17.0577682|210.5488452|19.6829249|13.1158767|245.1386503 unknown
InChI: InChI=1S/C19H24N2O3/c1-3-21(4-2)13-14-24-18(22)19(23,16-9-6-5-7-10-16)17-11-8-12-20-15-17/h5-12,15,23H,3-4,13-14H2,1-2H3
charge 0 multiplicity 1
48 atoms
O  -1.526155 0.088327 1.193529
O  1.977901 -0.938849 1.360434
O  -0.472577 -1.981809 1.403568
N  -3.044189 -1.326169 -1.029251
N  0.319194 0.491255 -2.814546
C  0.916563 0.008216 0.987699
C  -3.656964 -0.533647 0.061887
C  -2.874083 -0.534582 1.38076
C  -3.053628 -2.795885 -0.756506
C  -3.683982 -1.006764 -2.345469
C  1.020661 1.227166 1.927296
C  1.100815 0.396717 -0.492802
C  -0.433697 -0.73932 1.210881
C  -2.028177 -3.571342 -1.604356
C  -3.291118 0.362738 -2.931894
C  0.426243 2.463514 1.573526
C  1.692957 1.106194 3.166222
C  2.338151 0.971007 -0.880442
C  0.128005 0.170194 -1.495045
C  0.501121 3.565334 2.452215
C  1.768312 2.211519 4.044157
C  1.172022 3.443663 3.692167
C  2.549571 1.301157 -2.233189
C  1.513191 1.048047 -3.163986
H  -3.747331 0.511203 -0.2825
H  -4.695991 -0.881566 0.3119
H  -3.377955 0.114332 2.116263
H  -2.733797 -1.542805 1.804278
H  -2.790297 -2.951306 0.303751
H  -4.078672 -3.220871 -0.906997
H  -3.371144 -1.78804 -3.059403
H  -4.798808 -1.081461 -2.260716
H  -2.239567 -3.51333 -2.686826
H  -1.015615 -3.169818 -1.428762
H  -2.03418 -4.639657 -1.319396
H  -3.573281 1.203619 -2.271781
H  -2.205177 0.41687 -3.12103
H  -3.816487 0.514625 -3.893731
H  -0.09711 2.561658 0.616699
H  2.166461 0.152857 3.415647
H  3.114602 1.14155 -0.127869
H  1.590346 -1.855421 1.279393
H  -0.847085 -0.283635 -1.264898
H  0.03948 4.518202 2.169604
H  2.296168 2.110504 4.999289
H  1.232566 4.300893 4.37235
H  3.493357 1.744071 -2.566816
H  1.63588 1.294547 -4.225206
