program: Gaussian 09
title: 000211318
version: EM64L-G09RevD.01
frameworkgroup: C1[X(C11H15ClN2O4S)]
method: RPBEPBE
basis: SDD
operation: Freq
keyword: #p
keyword: freq=noraman
keyword: PBEPBE/SDD
title: #p freq=noraman PBEPBE/SDD
converged: YES YES NO NO
title: Mulliken charges:
elementType: Cl S O O O O N N C C C C C C C C C C C H H H H H H H H H H H H H H H
charge: -0.016971 0.935687 -0.534801 -0.513014 -0.446661 -0.232680 -0.430843 -0.712628 -0.424065 -0.339139 0.640113 -0.338016 0.062597 -0.382020 -0.485616 0.331651 -0.446152 -0.686425 0.101186 0.209402 0.208156 0.219600 0.219782 0.198728 0.198980 0.316019 0.299481 0.335264 0.222521 0.211510 0.212196 0.345169 0.331876 0.389114
chargesum: 0.00000
title: Mulliken charges with hydrogens summed into heavy atoms:
elementType: Cl S O O O O N N C C C C C C C C C C C
charge: -0.016971 0.935687 -0.534801 -0.513014 -0.057547 -0.232680 -0.114823 -0.035584 -0.006508 0.100243 0.640113 0.059693 0.062597 -0.382020 -0.186135 0.331651 -0.110888 -0.040198 0.101186
polarizability: 2.46101022e+02 -3.09365180e+00 2.24776964e+02 -2.39428869e+00 -8.21307678e-02 1.10645887e+02
1716.lowfreq: -3.4217 -0.0016 -0.0014 0.0008 5.9719 6.4720 26.9937 48.0636 50.0303
frequency: 26.9675 48.0555 50.0238 52.0434 55.2902 69.9752 100.0990 109.2242 116.5783 138.4113 150.6798 152.3496 184.5580 188.5604 192.2881 234.3125 235.4110 243.4935 248.6851 279.6353 294.4639 303.4486 337.7607 353.9722 390.1873 424.8594 444.8037 454.1280 481.7434 498.9917 510.9719 572.0185 574.8096 613.8267 625.3661 636.3607 728.8516 736.0192 741.0992 757.8869 796.9608 803.8999 815.1292 897.7384 901.2525 917.8332 925.7495 944.6195 954.4856 998.8559 1025.8277 1040.3001 1074.8991 1079.6965 1096.9050 1119.5739 1147.0884 1154.5477 1186.9899 1222.1270 1266.2046 1282.8980 1291.0218 1296.8297 1314.0224 1342.7318 1361.5571 1377.4384 1396.5385 1441.9240 1446.7492 1468.4229 1474.2175 1480.3292 1485.9490 1497.6656 1503.8959 1527.7166 1565.6801 1616.2192 1650.9757 2938.2727 2965.3430 2976.0351 2978.0173 2979.1073 3010.6073 3039.7534 3074.6627 3079.2600 3162.7722 3192.6280 3373.8523 3533.0020 3544.7032 3545.4897
redmass: 5.8470 2.5624 4.6279 3.1936 6.2972 5.4568 5.7782 8.3624 2.5367 2.3881 2.8135 2.4017 4.7203 6.2777 7.5788 1.1323 4.0326 4.6063 5.5188 3.5935 14.6109 7.0987 8.0034 4.0533 5.5131 6.9978 1.1201 3.6611 5.6922 5.9023 3.0812 5.0740 5.2526 1.4310 4.9073 5.5851 5.8426 1.3950 1.9710 3.6480 2.2081 1.1479 13.4616 2.0267 1.4516 4.0676 1.5967 1.1680 5.1492 6.0400 3.7268 2.9892 1.5905 2.2772 2.3906 1.9862 2.0484 1.5811 1.8879 1.3028 1.3517 1.1446 1.0622 1.6618 2.1196 1.7504 2.1487 2.2151 1.2177 3.2274 3.4044 1.0733 1.0665 1.0415 1.0741 1.2160 2.4926 1.0892 4.9923 7.6121 8.8627 1.0572 1.0586 1.0594 1.0363 1.1032 1.1010 1.1046 1.1010 1.0993 1.0920 1.0913 1.0412 1.0642 1.1008 1.0767
irintensity: 0.6835 0.2293 2.3970 0.5630 0.7290 0.4752 2.4169 0.0265 0.7747 12.7030 3.0538 13.7921 1.9605 1.2636 2.9129 0.0868 10.0861 0.6012 2.2400 0.0916 0.2659 2.6286 1.9874 10.6821 26.6041 81.0922 75.2575 166.2811 12.6429 22.0256 8.6221 25.0481 28.5072 111.6714 16.8250 10.5198 4.1530 40.6802 8.7734 54.8656 80.1132 0.5064 107.8879 8.8652 4.1576 66.5455 27.1277 0.1442 43.5712 53.0897 18.5175 257.0625 25.1324 1.0512 10.5643 6.9365 131.8176 0.7082 3.7620 0.0137 10.8000 0.2554 0.3120 24.5205 121.5031 10.3215 1.1840 45.4688 6.8969 25.7105 18.4426 6.7833 1.4068 13.7392 24.0954 121.7135 120.9563 31.1953 78.9812 362.6848 169.1210 37.3394 3.3304 63.1513 38.6382 17.7980 0.9345 48.4144 78.1779 45.1878 31.4784 4.0490 31.0923 51.4693 24.0321 48.3709
temp: 298.150 k
press: 1.00000 atm
elementType: 17 16 8 8 8 8 7 7 6 6 6 6 6 6 6 6 6 6 6 1 1 1 1 1 1 1 1 1 1 1 1 1 1 1
symmnumber: 1
zpe: 663599.6 jmol-1
zpe.correction: 0.252752 hartree
zpe.thermalcorrener: 0.274397 hartree
zpe.thermalcorrenthalpy: 0.275341 hartree
zpe.thermalcorrgfe: 0.200644 hartree
zpe.sumelectzpe: -1695.076835 hartree
zpe.sumelectthermal: -1695.055190 hartree
zpe.sumelectthermalent: -1695.054246 hartree
zpe.sumelectthermalfe: -1695.128943 hartree
dipole: 7.9144 -0.9122 2.6190
dipole: 8.3863
quadrupole: -129.4634 -119.3654 -131.2245
quadrupole: 10.0396 -12.1914 -7.8486
quadrupole: -2.7790 7.3190 -4.5401 10.0396 -12.1914 -7.8486
hfenergy: -1695.3295868 hartree
pointgroup: C01 [X(C11H15Cl1N2O4S1)]
dipole: 3.1302503 -0.194849 1.0245199 debye
polarizability: 246.2470781|-2.5736459|224.1694555|-3.082158|-6.9596419|111.1073397 unknown
InChI: InChI=1S/C11H15ClN2O4S/c1-2-3-4-14-8-5-7(11(15)16)6-9(10(8)12)19(13,17)18/h5-6,14-15H,2-4,13H2,1H3
charge 0 multiplicity 1
34 atoms
Cl -0.350774 -2.790638 0.190654
S  -3.438664 -1.423832 -0.001017
O  -4.659596 -0.350886 0.052551
O  -3.364188 -2.564204 -1.152782
O  0.156016 3.978408 -0.183645
O  -2.164297 3.870458 -0.17909
N  1.873075 -0.74457 0.067412
N  -3.410413 -2.21108 1.655374
C  4.342678 -0.914364 0.063481
C  3.123277 0.026717 0.031041
C  0.616074 -0.17638 0.026993
C  5.680298 -0.141214 0.02497
C  -1.834855 -0.397961 0.01563
C  -0.566446 -0.986036 0.059757
C  0.425302 1.236019 -0.045823
C  -0.866277 1.801951 -0.080734
C  -2.02534 0.987622 -0.050922
C  6.906126 -1.078667 0.048517
C  -1.061842 3.277376 -0.150915
H  4.295039 -1.607906 -0.800869
H  4.304883 -1.536256 0.981265
H  3.167891 0.722585 0.895969
H  3.160788 0.648431 -0.888922
H  5.726996 0.553033 0.888107
H  5.712588 0.48877 -0.886768
H  1.936086 -1.762793 0.114716
H  1.2890 1.902828 -0.071852
H  -3.029941 1.420765 -0.081612
H  7.849935 -0.505019 0.020385
H  6.91525 -1.699043 0.96425
H  6.900504 -1.762232 -0.821036
H  -4.324594 -2.030468 2.102312
H  -3.182343 -3.212675 1.553191
H  -0.038537 4.952562 -0.231185
